{"text_format":"1","workbook":"xlsx","n_sheets":12,"sheets":["Mainpage","subtotals","Goalseek","PivotTable","Vlookup_approx(easy)","vlookupexact","Vlookup(difficult)","Vlookup(2)","Filter","Texttocolumns","EasyFilter","PresentValue"],"not_rendered":{"charts":3,"images":2,"macros":1,"external_links":0,"defined_names":29,"comments":0,"pivot_tables":1},"unopened":[],"bounds":{"document_bytes":16777216,"sheet_cells":100000,"rows_first":2000,"rows_last":500,"rows_between":2000,"halvings":0,"cell_chars":16384,"cell_head_chars":4096},"cells_cut":0,"cells_raw":0,"read":"whole","date_system":"1900"}

{"sheet":"Mainpage","index":0,"n_rows":411,"n_cols":54,"rows_kept":411,"cut":false,"hidden":false,"merged":[]}
["Basic & Advanced Excel Concepts",null,null,null,null,null,null,"Dr. Michael Nieswiadomy"]
[null,null,null,null,null,null,null,"Modified on:","2024-02-22"]
[]
[1,"Rows and columns in the spreadsheet"]
[null,"a","Rows are numbered. 65,536 rows in previous versions of Excel.  Excel 2007 has 1,000,000 rows."]
[null,"b","Columns are lettered. 256 columns in previous versions of Excel. Excel 2007 has 16,000 columns."]
[null,"c","e.g. cell A5"]
[]
[]
[]
[]
[2,"Entering data"]
[null,"a","numbering methods"]
[null,null,"i.","e.g 1 to 20 can be entered manually (slow method)"]
[null,null,"ii.","or type 1 then 2 and drag"]
[null,null,"iii","use formula e.g. A1+ 1"]
[null,"b","Patterns recognized in Excel"]
[null,null,"i.","days, months, "]
[null,null,"ii.","you can repeat earlier cells by typing first few characters"]
[null,null,null,"Dallas"]
[null,null,null,"Denton"]
[null,null,null,"Ft. Worth"]
[]
[]
[]
[3,"Moving to the top of the sheet "]
[null,"To go to the top left of the sheet (cell A1):  Press Ctrl-Home (both keys at once)."]
[null,"To go to the end of a range (top, bottom, left, or right): Press the End key, then the appropriate arrow key.  For example, press"]
[null,"End and then right arrow to go to the right edge of a range. "]
[]
[4,"Splitting the screen "]
[null,"Go to View, Window, Split"]
[]
[5,"Selecting a range"]
[null,"To select a range that fits on a screen: Click on one corner, hold down the Shift key, and click on the opposite corner. "]
[]
[null,"To select a range that doesn’t fit on a screen"]
[null,"Click on one corner of the range, say, the upper left corner.  Then, holding the Shift key down, use the End-arrow combinations"]
[null,"(End and right arrow, then, if necessary, End and down arrow) to get to the opposite corner."]
[]
[6,"Copying & pasting (Ctrl c and ctrl v)"]
[null,"To copy and paste using keyboard shortcuts:  Select the copy range (using one of the efficient selection methods described"]
[null,"above), press Ctrl-c (for copy), select the paste range (again, efficiently), and press Ctrl-v (for paste)."]
[]
[null,"To copy with the drag handle:"]
[null,"Enter the formula in the top or left-hand cell of the intended range.  Place the cursor on the “drag handle” at the lower right of"]
[null,"this cell (the cursor becomes a plus sign), and drag this handle down or across to copy. "]
[]
[null,null,null,"number","number squared"]
[null,null,null,1,{"$f":"D50^2","v":1},null,"use F2 key; is EDIT key borrowed from Lotus"]
[null,null,null,2]
[null,null,null,3]
[null,null,null,4]
[null,null,null,5]
[]
[]
[]
[]
[]
[]
[null,"To copy by double-clicking on the drag handle:"]
[null,"Enter the formula in the top or left-hand cell of the intended range.  Double-click on the drag handle."]
[null,null,null,"number","number squared"]
[null,null,null,1,{"$f":"D64^2","v":1}]
[null,null,null,2,{"$f":"D65^2","v":4}]
[null,null,null,3,9]
[null,null,null,4,16]
[null,null,null,5,25]
[]
[null,"Copying and Pasting with the Special/Values option"]
[null,"To copy formulas and paste values:"]
[null,null,null,null,null,null,null,"paste special values"]
[null,null,null,"number","number squared",null,"number","number squared"]
[null,null,null,1,{"$f":"D74^2","v":1},null,1]
[null,null,null,2,{"$f":"D75^2","v":4},null,2]
[null,null,null,3,9,null,3]
[null,null,null,4,16,null,4]
[null,null,null,5,25,null,5]
[]
[7,"Moving (cutting and pasting)"]
[null,"To move (cut and paste):"]
[null,"Select the range to be cut, press Ctrl-x (for cutting), select the upper left corner of the paste range, and press Ctrl-v."]
[]
[8,"Sort sets of numbers"]
[null,"Name","Salary","Age","Height (in.)"]
[null,"Jones",22000,39,75]
[null,"Smith",25000,22,65]
[null,"Taylor",27000,43,70]
[]
[]
[9,"Formats"]
[null,"number, alignment, fonts, borders, patterns"]
[null,"e.g. salary in dollars and cents"]
[null,"Name","Salary","Age","Height (in.)"]
[null,"Jones",22000,39,65]
[null,"Smith",25000,22,75]
[null,"Taylor",27000,43,70]
[]
[9,"Column and row widths can be adjusted with mouse or format command"]
[]
[10,"Manipulating data with commands & formulas"]
[null,"e.g. Average"]
[]
[null,"Name","Salary","Age","Height (in.)"]
[null,"Jones",22000,39,65]
[null,"Smith",25000,22,68]
[null,"Taylor",27000,43,72]
[null,"Averages",{"$f":"AVERAGE(C105:C107)","v":24666.666666666668},{"$f":"AVERAGE(D105:D107)","v":34.666666666666664},{"$f":"AVERAGE(E105:E107)","v":68.333333333333329}]
[]
[null,"Use mouse or period to \"anchor\" the first cell and down arrow"]
[null,"Copy the formula to another cell rather than retyping"]
[]
[]
[null,"e.g. Multiplying using absolute reference"]
[]
[null,"Let's give"]
[null,"everyone a 20% increase in salary."]
[null,"(Show how to drag.  Big white plus sign, little black plus sign and white arrow)"]
[]
[null,"Name","Salary",null,null,"Salary plus","plus","plus","plus"]
[null,null,null,null,null,0.2,0.3,0.4,0.5]
[null,"Jones",22000]
[null,"Smith",25000]
[null,"Taylor",27000]
[null,"Averages",{"$f":"AVERAGE(C122:C124)","v":24666.666666666668}]
[]
[null,"Difference between relative reference & absolute reference (using $ signs) to refer to constant cell"]
[null,"You can use one dollar sign for half absolute reference to refer to a constant row or column"]
[]
[11,"Note on Paste Special Command"]
[null,null,"copy salary plus 20% column and paste as values, not formula"]
[]
[null,null,"Salary plus"]
[null,null,0.2]
[]
[]
[]
[]
[]
[12,"e.g. Exponentiation"]
[null,"What is future value of $100 earning 5% in two years?"]
[]
[null,null,"100*(1.05)^2=",null,"(hat \"^\" is on the 6 key)"]
[]
["13a","Dates",null,"2024-02-23"]
[null,null,null,"2024-07-07",{"$f":"D146","v":45480}]
[]
["13b","Fraction of year",null,{"$f":"(D146-D145)/366","v":0.36885245901639346}]
[]
[]
[]
[]
[14,"Present Value"]
[null,"a) one payment"]
[null,"What is present value of $1,200 to be received 2.5 years from now, if r = 5%?"]
[null,null,"Amount",1200]
[null,null,"years",2.5]
[null,null,"interest rate",0.05]
[null,null,"Present Value",{"$f":"D156/(1+D158)^2.5","v":1062.2041610324168},{"$f":"PV(D158,D157,,1200,)","v":-1062.2041610324168}]
[]
[null,"b) Series of payments (annuity)"]
[null,"What is present value of $100 per year for 5 years if r = 5%?"]
[]
[null,null,"Amount",1200]
[null,null,"years",2.5]
[null,null,"interest rate",0.05]
[]
[null,null,"Year","Annuity","PV"]
[null,null,1,100,{"$f":"D169/(1+$D$166)^C169","v":95.238095238095241}]
[null,null,2,100,{"$f":"D170/(1+$D$166)^C170","v":90.702947845804985}]
[null,null,3,100,{"$f":"D171/(1+$D$166)^C171","v":86.383759853147595},null,{"$f":"PV(0.05,3,,100,)","v":-86.383759853147595}]
[null,null,4,100,{"$f":"D172/(1+$D$166)^C172","v":82.2702474791882}]
[null,null,5,100,{"$f":"D173/(1+$D$166)^C173","v":78.352616646845888}]
[null,null,null,null,{"$f":"SUM(E169:E173)","v":432.94766706308189}]
[]
[]
[null,"Excel PV annuity formula"]
[null,null,null,"PV=",{"$f":"PV(D166,C173,D173)","v":-432.94766706308206}]
[]
[null,"See Present Value worksheet"]
[]
[]
[13,"Apostrophe"]
[null,"use to make a number or word a literal"]
[null,"e.g."]
[null,"Jan 5, 2005"]
[]
[null,"20"]
[null,30]
[null,{"$f":"AVERAGE(B188:B189)","v":30},"average of 20 and 30 is 30 because 20 is a literal, not a number"]
[]
[14,"Graphs"]
[]
[]
[]
[null,null,"GPA","Salary"]
[null,null,2.7,49000]
[null,null,2.9,51000]
[null,null,3.1,52000]
[null,null,3.2,53000]
[null,null,3.4,53500]
[null,null,3.7,54000]
[null,null,3.9,57000]
[]
[]
[]
[]
[]
[]
[]
[]
[]
[]
[]
[]
[]
[]
[]
[]
[]
[]
[]
[]
[]
[]
[]
[null,null,"Different presentations: e.g. Format graph to start at $45,000"]
[]
[]
[]
[]
[]
[]
[]
[]
[]
[]
[]
[]
[]
[]
[]
[]
[]
[]
[]
[]
[null,null,"\"How to Lie with Statistics\""]
[null,null,"http://www.amazon.com/How-Lie-Statistics-Darrell-Huff/dp/0393310728"]
[]
[]
[]
[]
[null,"Two lines on one graph"]
[]
[null,"Age","Denton Salary","Dallas Salary"]
[null,21,42000,50000]
[null,22,45000,52000]
[null,43,48000,55500]
[null,36,49500,57000]
[null,19,41700,48000]
[null,51,54000,64000]
[]
[]
[]
[]
[]
[]
[]
[]
[]
[]
[]
[]
[]
[]
[]
[]
[]
[]
[]
[]
[]
[]
[]
[]
[]
[]
[]
[]
[15,"Freeze panes, paste special transpose and a mystery…"]
[null,null,null,"CSI question:","What variable is being used here?"]
[null,null,null,null,"Hint: It is not an income variable."]
[]
[null,null,"xx","Alabama","Alaska","Arizona","Arkansas","California","Colorado","Connecticut","Delaware","District of Columbia","Florida","Georgia","Hawaii","Idaho","Illinois","Indiana","Iowa","Kansas","Kentucky","Louisiana","Maine","Maryland","Massachusetts","Michigan","Minnesota","Mississippi","Missouri","Montana","Nebraska","Nevada","New Hampshire","New Jersey","New Mexico","New York","North Carolina","North Dakota","Ohio","Oklahoma","Oregon","Pennsylvania","Rhode Island","South Carolina","South Dakota","Tennessee","Texas","Utah","Vermont","Virginia","Washington","West Virginia","Wisconsin","Wyoming"]
[null,null,"January",{"$f":"RANDBETWEEN(0,1000)","v":650},{"$f":"RANDBETWEEN(0,1000)","v":605},59,213,51,854,987,385,913,891,922,29,428,910,161,429,403,617,174,808,340,724,155,831,77,147,106,436,811,946,496,90,174,169,199,400,635,159,632,756,490,26,673,66,173,175,802,472,351,602,943]
[null,null,"February",53,{"$f":"RANDBETWEEN(0,1000)","v":122},760,692,118,822,638,425,8,279,87,118,573,344,539,588,345,576,549,676,679,187,690,269,815,583,18,400,632,83,514,715,170,7,242,137,666,542,426,562,973,540,739,188,14,18,549,366,566,296,399]
[null,null,"March",530,443,199,141,466,915,572,853,467,374,325,186,832,876,340,850,2,91,183,206,494,126,306,113,630,506,556,936,485,753,773,330,171,918,918,694,409,952,99,4,488,162,517,32,267,391,672,809,348,258,541]
[null,null,"April",798,618,291,825,530,18,81,669,274,300,953,725,182,183,338,182,33,344,747,858,631,297,466,992,220,649,264,500,206,302,258,870,764,174,387,274,841,579,866,935,136,270,174,138,42,930,654,291,103,447,557]
[null,null,"May",25,875,788,271,586,267,603,10,937,760,484,174,525,207,741,71,256,580,862,823,252,356,886,896,890,463,907,212,847,256,864,579,414,43,34,925,792,13,380,642,166,199,945,480,80,141,880,947,650,373,691]
[null,null,"June",881,338,322,343,534,861,84,5,793,882,212,610,746,282,667,174,630,622,246,241,770,{"$f":"RANDBETWEEN(0,1000)","v":363},68,219,705,296,350,766,363,333,216,365,208,924,547,331,221,540,232,555,358,762,94,652,396,462,40,485,271,286,496]
[null,null,"July",290,895,613,3,322,174,47,663,930,65,931,795,767,239,854,779,711,692,987,198,181,858,472,995,356,523,16,36,497,598,895,847,905,801,848,724,973,552,926,976,462,125,240,802,912,274,387,286,591,334,785]
[null,null,"August",673,321,254,978,845,585,51,360,863,611,531,260,915,730,347,741,630,676,375,701,903,653,283,665,421,487,827,464,829,507,985,23,861,798,55,710,145,80,919,549,671,303,264,97,854,882,685,247,66,344,349]
[null,null,"September",301,228,422,24,341,830,392,998,615,183,151,719,891,505,815,419,207,494,155,855,4,564,830,303,842,459,909,191,521,178,299,994,383,282,415,574,900,67,894,763,374,193,52,717,245,384,397,788,398,98,725]
[null,null,"October",886,955,947,36,971,347,546,712,107,217,828,107,573,437,3,330,935,980,526,828,207,781,502,787,631,719,354,94,60,865,946,76,645,537,852,424,100,694,326,828,462,389,224,584,63,672,11,700,674,200,866]
[null,null,"November",610,483,433,219,331,968,62,161,413,639,308,315,840,201,64,498,217,281,274,891,557,472,525,529,297,840,{"$f":"RANDBETWEEN(0,1000)","v":580},658,271,779,902,320,10,133,715,601,674,727,191,62,327,359,357,586,353,405,136,171,28,141,15]
[null,null,"December",944,866,769,891,305,49,67,949,110,752,678,859,746,9,958,376,597,230,932,52,989,931,126,426,485,859,807,810,880,272,820,135,946,502,972,209,290,870,190,256,400,24,566,552,7,389,480,996,333,345,227]
[]
[16,"Printing"]
[null,"a","select area"]
[null,"b","portrait or landscape"]
[null,"c","headers or footers"]
[]
[]
[16,"Subtotals (also IF statements)"]
[null,"go to \"subtotals\" worksheet"]
[]
[]
[17,"Macros"]
[null,"Insert two blank rows bewteen every month"]
[null,"Select February row, i.e., row 341, then hit contol \"e\""]
[]
[null,null,"Alabama","Alaska","Arizona","Arkansas","California"]
[null,"January",564,525,474,513,247]
[null,"February",844,187,370,710,834]
[null,"March",98,337,223,893,285]
[null,"April",991,885,534,763,520]
[null,"May",659,778,904,637,730]
[null,"June",248,24,25,141,688]
[null,"July",592,509,772,143,359]
[null,"August",411,610,505,660,873]
[null,"September",786,961,573,19,974]
[null,"October",91,435,1000,122,688]
[null,"November",395,550,36,516,961]
[null,"December",368,433,168,611,429]
[]
[]
[]
[]
[]
[18,"Pivot Tables"]
[null,"click on \"PivotTable\" worksheet"]
[]
[]
[19,"Vlookup and naming ranges"]
[null,"click on vlookup (easy)"]
[null,"click on vlookup (exact)"]
[null,"click on vlookup (difficult)"]
[]
[]
[]
[]
[]
[]
[20,"Countif"]
[]
[]
[]
[null,"year","Month","Quarter","Monthlysales"]
[null,2000,1,{"$f":"IF(C360<=3,1,IF(C360<=6,2,IF(C360<=9,3,IF(C360<=12,4,\"x\"))))","v":1},84]
[null,2000,2,{"$f":"IF(C361<=3,1,IF(C361<=6,2,IF(C361<=9,3,IF(C361<=12,4,\"x\"))))","v":1},36]
[null,2000,3,1,13]
[null,2000,4,2,490]
[null,2000,5,2,500]
[null,2000,6,2,3000]
[null,2000,7,3,54]
[null,2000,8,3,32]
[null,2000,9,3,36]
[null,2000,10,4,75]
[null,2000,11,4,2]
[null,2000,12,4,21]
[null,2001,1,1,71]
[null,2001,2,1,41]
[null,2001,3,1,64]
[null,2001,4,2,64]
[null,2001,5,2,43]
[null,2001,6,2,71]
[null,2001,7,3,13]
[null,2001,8,3,30]
[null,2001,9,3,69]
[null,2001,10,4,86]
[null,2001,11,4,49]
[null,2001,12,4,100]
[null,null,null,null,{"$f":"COUNTIF(E360:E383,\">400\")","v":3},"countif if greater than 400"]
[null,null,null,null,{"$f":"COUNTIF($E$360:$E$383,G385)","v":3},null,">400","alternative way"]
[null,null,null,null,{"$f":"COUNTIF($E$360:$E$383,G386)","v":12},null,">60"]
[21,"Filter and Mid and Find formula"]
[null,"click on Filter worksheet"]
[]
[22,"Text to columns:Import text as data, e.g. a pdf file"]
[null,"click on \"texttocolumns\" worksheet"]
[]
[]
[]
[]
[23,"Goal Seek"]
[]
[null,"Jim's Grades"]
[]
[null,"component","Midterm1","Midterm2","HwkAvg","Final","Semester","Goal"]
[null,"weight",0.25,0.25,0.2,0.3]
[null,"score",71,74,81,91.8333333333333,{"$f":"C402*C401+D402*D401+E402*E401+F402*F401","v":80},80]
[null,null,null,null,null,null,{"$f":"SUMPRODUCT(C401:F401,C402:F402)","v":80},"sumproduct command does the same"]
[null,"click on \"goalseek\" worksheet"]
[]
[]
[]
[]
[]
[24,"Summary "]
[null,"Experiment with every feature in Excel!"]

{"sheet":"subtotals","index":1,"n_rows":36,"n_cols":9,"rows_kept":36,"cut":false,"hidden":false,"merged":[]}
["Year","Month","quarter","monthsales",null,null,null,null,"if statements"]
[2000,1,{"$f":"IF(B2<=3,A2&\"Q1\",IF(B2<=6,A2&\"Q2\",IF(B2<=9,A2&\"Q3\",IF(B2<=12,A2&\"Q4\",\"x\"))))","v":"2000Q1"},84,null,2000,1,84,{"$f":"IF(OR(G2=3,G2=6,G2=9,G2=12),SUM(#REF!),\"x\")","v":"x"}]
[2000,2,{"$f":"IF(B3<=3,A3&\"Q1\",IF(B3<=6,A3&\"Q2\",IF(B3<=9,A3&\"Q3\",IF(B3<=12,A3&\"Q4\",\"x\"))))","v":"2000Q1"},36,null,null,2,36,{"$f":"IF(OR(G3=3,G3=6,G3=9,G3=12),SUM(G1:G3),\"x\")","v":"x"}]
[2000,3,"2000Q1",13,null,null,3,13,{"$f":"IF(OR(G4=3,G4=6,G4=9,G4=12),SUM(H2:H4),\"x\")","v":133}]
[2000,4,"2000Q2",49,null,null,4,49,{"$f":"IF(OR(G5=3,G5=6,G5=9,G5=12),SUM(H3:H5),\"x\")","v":"x"}]
[2000,5,"2000Q2",50,null,null,5,50,{"$f":"IF(OR(G6=3,G6=6,G6=9,G6=12),SUM(H4:H6),\"x\")","v":"x"}]
[2000,6,"2000Q2",30,null,null,6,30,129]
[2000,7,"2000Q3",54,null,null,7,54,{"$f":"IF(OR(G8=3,G8=6,G8=9,G8=12),SUM(H6:H8),\"x\")","v":"x"}]
[2000,8,"2000Q3",32,null,null,8,32,{"$f":"IF(OR(G9=3,G9=6,G9=9,G9=12),SUM(H7:H9),\"x\")","v":"x"}]
[2000,9,"2000Q3",36,null,null,9,36,122]
[2000,10,"2000Q4",75,null,null,10,75,{"$f":"IF(OR(G11=3,G11=6,G11=9,G11=12),SUM(H9:H11),\"x\")","v":"x"}]
[2000,11,"2000Q4",2,null,null,11,2,{"$f":"IF(OR(G12=3,G12=6,G12=9,G12=12),SUM(H10:H12),\"x\")","v":"x"}]
[2000,12,"2000Q4",21,null,null,12,21,98]
[2001,1,"2001Q1",71,null,2001,1,71,{"$f":"IF(OR(G14=3,G14=6,G14=9,G14=12),SUM(H12:H14),\"x\")","v":"x"}]
[2001,2,"2001Q1",41,null,null,2,41,{"$f":"IF(OR(G15=3,G15=6,G15=9,G15=12),SUM(H13:H15),\"x\")","v":"x"}]
[2001,3,"2001Q1",64,null,null,3,64,176]
[2001,4,"2001Q2",64,null,null,4,64,{"$f":"IF(OR(G17=3,G17=6,G17=9,G17=12),SUM(H15:H17),\"x\")","v":"x"}]
[2001,5,"2001Q2",43,null,null,5,43,{"$f":"IF(OR(G18=3,G18=6,G18=9,G18=12),SUM(H16:H18),\"x\")","v":"x"}]
[2001,6,"2001Q2",71,null,null,6,71,178]
[2001,7,"2001Q3",13,null,null,7,13,{"$f":"IF(OR(G20=3,G20=6,G20=9,G20=12),SUM(H18:H20),\"x\")","v":"x"}]
[2001,8,"2001Q3",30,null,null,8,30,{"$f":"IF(OR(G21=3,G21=6,G21=9,G21=12),SUM(H19:H21),\"x\")","v":"x"}]
[2001,9,"2001Q3",69,null,null,9,69,112]
[2001,10,"2001Q4",86,null,null,10,86,{"$f":"IF(OR(G23=3,G23=6,G23=9,G23=12),SUM(H21:H23),\"x\")","v":"x"}]
[2001,11,"2001Q4",49,null,null,11,49,{"$f":"IF(OR(G24=3,G24=6,G24=9,G24=12),SUM(H22:H24),\"x\")","v":"x"}]
[2001,12,"2001Q4",100,null,null,12,100,235]
[]
[null,null,"Copy and paste subtotals here.  This is tricky."]
[null,null,"quarter","monthsales"]
[null,null,"2000Q1 Total",133]
[null,null,"2000Q2 Total",129]
[null,null,"2000Q3 Total",122]
[null,null,"2000Q4 Total",98]
[null,null,"2001Q1 Total",176]
[null,null,"2001Q2 Total",178]
[null,null,"2001Q3 Total",112]
[null,null,"2001Q4 Total",235]

{"sheet":"Goalseek","index":2,"n_rows":18,"n_cols":4,"rows_kept":18,"cut":false,"hidden":false,"merged":[[0,0,1,8]]}
["If you began on 12/31/02 with $10,000 in your 403(b) plan, made the contributions listed below, and ended with a balance of $20,000 on 12/31/06, what was your average annual rate of return?"]
[]
[]
[]
[null,null,"2006-12-31"]
[null,null,null,7.1207026553427089E-2]
["2002-12-31",10000,{"$f":"($C$5-A7)/365.25","v":4},{"$f":"B7*(1+$D$6)^C7","v":13167.206633678563}]
["2003-03-31",600,{"$f":"($C$5-A8)/365.25","v":3.7535934291581108},{"$f":"B8*(1+$D$6)^C8","v":776.75471151934221}]
["2003-04-15",500,3.7125256673511293,645.46963427573542]
["2003-07-25",500,3.4360027378507869,633.3082307655186]
["2004-06-01",800,2.5817932922655715,955.46979782733581]
["2005-10-25",600,1.1827515400410678,650.85474491703508]
["2005-10-27",1200,1.1772758384668036,1301.2192906501991]
["2006-03-15",600,0.79671457905544152,633.79941478709736]
["2006-06-02",600,0.58042436687200549,624.43970095254542]
["2006-09-22",600,0.27378507871321012,611.40663170059736]
[null,null,null,{"$f":"SUM(D6:D16)","v":19999.99999810052}]
["2016-12-31"]

{"sheet":"PivotTable","index":3,"n_rows":106,"n_cols":12,"rows_kept":106,"cut":false,"hidden":false,"merged":[]}
["Price ($1,000)","Bedrooms","Size","Pool","Distance","Garage","Baths",null,null,{"$f":"B1","v":"Bedrooms"},{"$f":"J1","v":"Bedrooms"}]
[213.56999588012695,2,2188,1,16,0,2.5,null,{"$f":"DAVERAGE(A1:G106,1,J1:K2)","v":221.10055673086973},">=1","<=10"]
[139.85999794006349,2,2148,1,28,0,1.5]
[271.75500411987309,2,2130,1,9,1,2.5]
[208.98000411987306,2,1715,1,8,1,1.5]
[257.17500000000001,2,2117,1,9,1,2]
[173.06999588012695,2,2198,0,21,1,1.5]
[245.43000411987308,2,2117,0,12,1,2]
[233.95500411987305,2,1712,1,19,1,2]
[222.07499999999999,2,2054,1,9,1,2]
[220.88700000000003,2,2328.6999999999998,0,12,1,2]
[207.08999176025392,2,1974,1,11,1,2]
[194.4,2,2283,1,11,0,2]
[294.03000411987307,2,2133,1,13,1,2.5]
[186.97499999999999,2,1912,1,26,0,2,null,"Average of Price ($1,000)","Column Labels"]
[125.00999794006349,2,1871,1,18,0,1.5,null,"Row Labels",0,1,"Grand Total"]
[180.36000823974609,2,2041,1,11,0,2,null,2,203.92425205993655,199.61842541198729,200.33606318664553]
[192.21299999999999,2,2406.8000000000002,1,16,0,2.5,null,3,205.40153483145582,225.00000000000003,214.44698029386083]
[125.874,2,2362.8000000000002,1,28,0,1.5,null,4,201.37458959822223,222.52320054931641,213.57571130077653]
[177.11999588012696,2,1919,1,10,1,2,null,5,218.44012294006347,230.34857025146488,226.0182257745916]
[244.5795,2,2343,1,9,1,2.5,null,6,185.19299835205081,289.35449816894538,252.15396252005445]
[176.31000823974611,2,2037,0,17,0,2,null,7,null,303.20999794006349,303.20999794006349]
[188.08199999999999,2,1886.5,1,8,1,1.5,null,8,null,328.06350205993658,328.06350205993658]
[174.96,2,2511.3000000000002,1,11,0,2,null,"Grand Total",202.79380171002845,231.48349241433215,221.10055673086981]
[154.30500411987305,2,2007,1,13,0,2]
[199.017,3,2479.4,0,18,0,1.5]
[281.33999176025395,3,2119,1,16,1,2]
[253.20600000000002,3,2330.9,1,16,1,2]
[251.36999588012696,3,1937,1,12,1,2]
[206.0100082397461,3,2090,0,9,0,1.5]
[242.05500411987308,3,2271,1,12,0,2]
[221.13000411987306,3,2254,0,18,0,1.5]
[228.41999588012698,3,2263,1,17,1,1.5]
[223.96499176025392,3,1900,0,6,1,2]
[307.8,3,2431,0,21,1,3]
[224.77500000000001,3,2157,1,17,1,2.5]
[217.84950000000003,3,2498.1,1,12,0,2]
[216.81000823974611,3,2221,1,15,1,2]
[232.2,3,1928,0,16,1,1.5]
[166.45500411987305,3,1593,0,19,0,2.5]
[207.49499588012696,3,2080,0,10,0,2]
[205.06499176025392,3,2012,0,20,0,2]
[199.8,3,2069,1,19,1,2]
[198.85500411987306,3,2220,0,10,1,2]
[190.88999176025391,3,2190,0,18,1,2]
[178.96950000000001,3,2442,0,10,1,2]
[178.96950000000001,3,2442,1,8,1,2]
[233.0100082397461,3,2162,1,14,1,1.5]
[172.39499588012697,3,2218,1,23,0,2]
[171.58499794006349,3,2014,0,16,0,2]
[166.18499794006348,3,2019,0,16,1,2]
[292.41000823974611,4,2108,1,14,1,2]
[266.625,4,2385,1,13,1,2]
[263.16900000000004,4,2318.8000000000002,1,14,1,2]
[263.11499176025393,4,2349,0,17,1,2]
[254.33999176025392,4,2495,0,15,1,2]
[252.31499176025392,4,2624,1,8,1,2]
[192.91499176025391,4,1938,0,14,1,2.5]
[246.10500411987306,4,2073,1,18,1,2]
[239.96250000000001,4,2623.5,1,13,1,2]
[236.80350000000001,4,2583.9,0,17,1,2]
[182.65500411987307,4,2023,0,14,0,2.5]
[227.08350000000002,4,2886.4,1,8,1,2]
[198.31499176025392,4,2056,0,19,1,1.5]
[221.49450000000002,4,2280.3000000000002,1,18,1,2]
[216,4,2310,1,19,0,2]
[209.65500411987307,4,2210,0,19,1,2]
[189.40500411987307,4,2221,1,24,1,2]
[182.3850082397461,4,2102,1,19,0,2]
[176.03999176025391,4,2230,1,15,1,2]
[175.6350082397461,4,2262,0,24,1,2]
[173.62350000000004,4,2131.8000000000002,1,9,1,2]
[172.66500205993654,4,2189,0,16,0,2]
[164.1465,4,2312.1999999999998,1,19,0,2]
[173.62350000000004,4,2131.8000000000002,0,14,1,2.5]
[155.39850000000001,4,2407.9,0,16,0,2]
[227.08350000000002,4,2886.4,1,20,0,1.5]
[207.49499588012696,5,2316,0,21,0,2.5]
[209.25,5,2101,1,20,0,1.5]
[247.72499999999999,5,2438,1,16,1,2]
[236.3850082397461,5,2189,1,20,1,2]
[273.23999176025393,5,2182,1,16,1,3]
[269.18999176025392,5,2217,1,8,1,3]
[209.65500411987307,5,2247,0,13,1,2]
[269.86499176025393,5,2170,0,11,1,2.5]
[186.74550000000002,5,2547.6,0,21,0,2.5]
[188.32499999999999,5,2311.1,1,20,0,1.5]
[188.32499999999999,5,2311.1,1,11,1,3]
[327.23999176025393,6,2484,1,15,1,2]
[294.51600000000002,6,2732.4,1,15,1,2]
[270.81000823974614,6,2495,1,7,1,2]
[326.29499588012698,6,2141,1,11,1,3]
[243.72900000000001,6,2744.5,1,7,1,2]
[312.11999588012696,6,2639,1,7,1,2.5]
[245.96999588012696,6,2296,1,7,1,3]
[209.25,6,1901,0,15,1,2]
[289.84499588012699,6,2036,1,21,1,3]
[192.64499588012697,6,2236,0,14,0,2]
[188.32499999999999,6,2091.1,0,15,1,2]
[293.66550000000001,6,2355.1,1,11,1,3]
[188.32499999999999,6,2091.1,0,14,1,2.5]
[147.41999588012698,6,1749,0,12,0,2]
[294.3,7,2448,1,8,1,2]
[312.11999588012696,7,2403,1,13,1,3]
[345.33000411987308,8,2644,1,9,1,2]
[310.79700000000003,8,2908.4,1,9,1,2]

{"sheet":"Vlookup_approx(easy)","index":4,"n_rows":75,"n_cols":4,"rows_kept":75,"cut":false,"hidden":false,"merged":[]}
[]
["Student","Score","Grade","Comment"]
[1,67.2,{"$f":"VLOOKUP($B3,$B$71:$D$75,2,TRUE)","v":"D"},{"$f":"VLOOKUP($B3,$B$71:$D$75,3,TRUE)","v":"Help my Obi-Wan Kenobi.  You are my only hope."}]
[2,72.3,{"$f":"VLOOKUP($B4,$B$71:$C$75,2,TRUE)","v":"C"},"You need more Jedi training."]
[3,97.4,"A","You are a Jedi Master!"]
[4,70.599999999999994,"C","You need more Jedi training."]
[5,76.2,"C","You need more Jedi training."]
[6,41.4,"F","But beware of the dark side!"]
[7,89.9,"B","Do or do not. There is no try."]
[8,59.2,"F","But beware of the dark side!"]
[9,90.2,"A","You are a Jedi Master!"]
[]
[]
[]
[]
[]
[]
[]
[]
[]
[]
[]
[]
[]
[]
[]
[]
[]
[]
[]
[]
[]
[]
[]
[]
[]
[]
[]
[]
[]
[]
[]
[]
[]
[]
[]
[]
[]
[]
[]
[]
[]
[]
[]
[]
[]
[]
[]
[]
[]
[]
[]
[]
[]
[]
[]
[]
[]
["Name the range for grades"]
[]
[null,0,"F","But beware of the dark side!"]
[null,60,"D","Help my Obi-Wan Kenobi.  You are my only hope."]
[null,70,"C","You need more Jedi training."]
[null,80,"B","Do or do not. There is no try."]
[null,90,"A","You are a Jedi Master!"]

{"sheet":"vlookupexact","index":5,"n_rows":142,"n_cols":18,"rows_kept":142,"cut":false,"hidden":false,"merged":[]}
[null,null,null,null,null,"ID","Wage","Industry","Occupation","Ed","South","Nonwh","Hisp","Fe","Ex","Marr","Age","Union"]
[null,null,null,null,null,1096588,19388,1,0,6,1,0,0,0,45,1,57,0]
[null,null,null,null,null,1056904,49898,2,0,12,0,0,0,0,33,1,51,1]
[null,null,null,null,null,1018343,28219,0,3,12,1,0,0,0,12,1,30,0]
[null,null,null,null,null,1041245,83600.999999999985,0,5,17,0,0,1,0,18,1,41,0]
[null,null,null,null,null,1085115,29736,0,4,8,0,0,1,0,47,1,61,1]
[null,null,null,null,null,1097210,50235,1,0,16,0,0,0,0,12,1,34,0]
[null,null,null,null,null,1009753,45976,0,2,12,0,0,0,0,43,1,61,1]
[null,null,null,null,null,1038675,33411,1,2,12,1,0,0,0,20,1,38,0]
[null,null,null,null,null,1048747,21716,0,5,12,0,0,0,1,11,0,29,0]
[null,null,null,null,null,1015098,37664,0,5,18,0,0,0,0,19,1,43,0]
[null,null,null,null,null,1091094,26820,0,5,18,0,0,0,0,33,0,57,1]
[null,null,null,null,null,1013810,29977,0,4,16,0,1,0,1,6,1,28,0]
[null,null,null,null,null,1081786,33959,0,5,17,0,0,0,1,26,1,49,1]
[null,null,null,null,null,1052465,11780,0,2,11,0,0,0,1,33,1,50,0]
[null,null,null,null,null,1011923,10997,0,4,14,0,1,0,0,0,0,20,0]
[null,null,null,null,null,1003672,17626,0,3,12,0,0,0,1,45,1,63,0]
[null,null,null,null,null,1068526,22133,0,5,16,0,0,0,1,10,0,32,1]
[null,null,null,null,null,1025720,21994.000000000004,0,1,12,0,0,0,1,24,1,42,0]
[null,null,null,null,null,1057220,29389.999999999996,0,0,13,0,0,0,0,18,1,37,0]
[null,null,null,null,null,1079370,32137.999999999996,0,4,14,0,0,0,0,22,1,42,1]
[null,null,null,null,null,1097079,30006,1,3,16,0,0,0,1,27,1,49,0]
[null,null,null,null,null,1002246,68573,0,5,16,1,0,0,0,14,1,36,1]
[null,null,null,null,null,1098521,17694,0,4,8,0,0,0,1,38,1,52,0]
[null,null,null,null,null,1002348,26795,0,0,7,1,0,0,0,44,1,57,0]
[null,null,null,null,null,1017177,19981,0,4,4,0,0,0,0,54,1,64,0]
[null,null,null,null,null,1062369,14475.999999999998,0,5,12,0,0,0,1,3,1,21,0]
[null,null,null,null,null,1013047,19452,0,4,13,0,1,0,0,3,0,22,0]
[null,null,null,null,null,1098068,28167.999999999996,1,0,13,0,0,0,0,17,0,36,0]
[null,null,null,null,null,1029857,19306,0,5,9,1,1,0,1,34,1,49,1]
[null,null,null,null,null,1023062,13318,1,0,11,1,0,0,1,25,1,42,1]
[null,null,null,null,null,1014112,25166.000000000004,0,4,12,0,0,0,1,10,0,28,0]
[null,null,null,null,null,1041805,18121,1,3,12,0,0,0,1,18,1,36,0]
[null,null,null,null,null,1014685,13162,1,0,12,0,1,0,0,6,0,24,1]
[null,null,null,null,null,1001763,32094,0,3,12,1,0,0,1,14,1,32,0]
[null,null,null,null,null,1001589,16666.999999999996,0,3,12,1,0,0,0,4,0,22,0]
[null,null,null,null,null,1067489,50171,0,5,12,0,0,0,0,39,1,57,1]
[null,null,null,null,null,1072615,31691.000000000004,1,0,12,0,0,0,0,13,0,31,0]
[null,null,null,null,null,1069721,36178,0,3,12,0,0,0,1,40,1,58,0]
[null,null,null,null,null,1035345,15234.000000000002,0,1,12,1,0,1,1,4,0,22,0]
[null,null,null,null,null,1086190,16816.999999999996,0,3,12,1,0,0,1,26,0,44,0]
[null,null,null,null,null,1042618,22485,0,3,12,0,0,0,0,22,0,40,0]
[null,null,null,null,null,1031387,30308,0,4,12,0,0,0,0,10,1,28,0]
[null,null,null,null,null,1060440,11702,0,2,14,1,0,0,1,6,1,26,0]
[null,null,null,null,null,1024478,11186,0,0,12,0,0,0,0,0,0,18,0]
[null,null,null,null,null,1051572,12285,0,1,12,0,0,0,1,42,1,60,0]
[null,null,null,null,null,1067775,19284,1,4,16,0,0,0,0,3,0,25,0]
[null,null,null,null,null,1005205,11451,1,0,12,0,0,0,1,8,1,26,0]
[null,null,null,null,null,1067179,57623,0,1,15,0,0,0,0,31,1,52,0]
[null,null,null,null,null,1057026,25669.999999999996,0,3,13,0,0,0,1,8,0,27,1]
[null,null,null,null,null,1097270,83442.999999999985,0,5,17,0,0,0,1,5,0,28,0]
[null,null,null,null,null,1091088,49974,1,1,16,0,1,0,0,26,1,48,1]
[null,null,null,null,null,1088189,46646,2,0,5,1,0,0,0,44,1,55,0]
[null,null,null,null,null,1077841,31702,0,3,12,1,0,0,1,39,1,57,0]
[null,null,null,null,null,1056783,13311.999999999998,0,4,12,1,0,0,1,9,1,27,0]
[null,null,null,null,null,1085868,44543,0,2,18,0,0,0,0,10,1,34,0]
[null,null,null,null,null,1046294,15013,0,4,16,0,0,0,0,21,1,43,0]
[null,null,null,null,null,1064905,33389,0,1,14,0,1,0,0,22,0,42,0]
[null,null,null,null,null,1081864,60626.000000000007,0,5,18,0,0,0,0,7,1,31,0]
[null,null,null,null,null,1079345,24509,0,5,14,0,0,1,1,15,0,35,0]
[null,null,null,null,null,1032216,20852.000000000004,1,0,12,0,0,0,1,38,1,56,0]
[null,null,null,null,null,1085144,30133,2,0,10,0,0,0,0,27,1,43,0]
[null,null,null,null,null,1044194,31799,0,3,12,0,0,0,1,25,0,43,0]
[null,null,null,null,null,1077722,16795.999999999996,0,4,12,0,0,0,1,14,1,32,0]
[null,null,null,null,null,1033265,20793.000000000004,0,0,12,1,0,0,1,6,0,24,0]
[null,null,null,null,null,1066563,29406.999999999996,0,4,10,1,0,0,0,19,0,35,0]
[null,null,null,null,null,1037201,29190.999999999996,0,0,12,0,0,0,0,9,0,27,0]
[null,null,null,null,null,1036823,15957,0,2,12,1,0,0,1,10,0,28,0]
[null,null,null,null,null,1046425,34484,0,3,13,1,0,0,1,28,0,47,0]
[null,null,null,null,null,1000018,35185,1,3,14,0,0,0,1,12,1,32,0]
[null,null,null,null,null,1094460,26614,1,0,12,0,0,0,1,19,1,37,0]
[null,null,null,null,null,1033455,41779.999999999993,0,0,12,1,0,0,0,9,1,27,0]
[null,null,null,null,null,1049277,55776.999999999993,0,1,14,1,0,0,0,21,1,41,0]
[null,null,null,null,null,1059354,15160.000000000002,0,4,8,1,0,0,1,45,0,59,0]
[null,null,null,null,null,1038360,66737.999999999985,0,0,9,1,0,0,0,29,1,44,0]
[null,null,null,null,null,1037827,33351,0,5,16,1,0,0,1,4,1,26,0]
[null,null,null,null,null,1062114,33498,0,1,10,0,0,0,0,20,1,36,0]
[null,null,null,null,null,1005477,29808.999999999996,0,4,8,0,1,0,1,29,0,43,0]
[null,null,null,null,null,1056394,15193,1,0,12,0,0,0,1,15,0,33,0]
[null,null,null,null,null,1058677,23027,0,4,14,0,1,0,0,34,1,54,1]
[null,null,null,null,null,1042741,75165,0,1,15,0,0,0,0,12,1,33,0]
[null,null,null,null,null,1016499,18752,0,4,11,0,0,0,1,45,0,62,1]
[null,null,null,null,null,1090234,83568.999999999985,0,1,18,0,0,0,0,29,1,53,0]
[null,null,null,null,null,1006532,32235,0,3,12,0,0,0,1,38,1,56,0]
[null,null,null,null,null,1028973,20852.000000000004,0,0,12,1,0,0,0,1,0,19,0]
[null,null,null,null,null,1045045,13787.000000000002,0,4,11,0,0,0,0,4,1,21,0]
[null,null,null,null,null,1023467,34746,0,3,14,1,0,0,1,15,1,35,0]
[null,null,null,null,null,1043517,17690,0,1,12,1,1,0,0,14,1,32,0]
[null,null,null,null,null,1051041,52761.999999999993,0,5,18,0,0,0,0,7,1,31,0]
[null,null,null,null,null,1075653,60152,0,5,16,1,0,0,0,38,1,60,0]
[null,null,null,null,null,1000402,33461,0,1,16,0,0,1,0,7,1,29,1]
[null,null,null,null,null,1030528,13481,0,4,12,1,0,1,0,7,0,25,0]
[null,null,null,null,null,1042742,9879,0,3,12,1,0,0,1,28,1,46,0]
[null,null,null,null,null,1042542,16788.999999999996,0,3,13,1,0,0,1,6,1,25,0]
[null,null,null,null,null,1041889,31303.999999999996,0,1,16,0,0,0,1,26,1,48,0]
[null,null,null,null,null,1053577,37771,0,5,15,0,0,0,0,5,0,26,0]
[null,null,null,null,null,1084318,50186.999999999993,0,3,12,0,0,0,1,24,1,42,0]
[null,null,null,null,null,1065700,39888,0,3,12,1,0,0,0,5,0,23,0]
[null,null,null,null,null,1083628,19227,0,3,12,0,0,0,1,15,1,33,0]
[null,null,null,null,null,1085915,32786,1,0,11,1,0,0,0,37,1,54,1]
[null,null,null,null,null,1067611,28440,0,4,12,0,0,0,1,24,1,42,0]
[]
["VLOOKUP (lookup_value, table_array, column_index_num, range_lookup)"]
["Absolute Reference"]
[]
["ID","Wage"]
[1006532,{"$f":"VLOOKUP(A107,$F$2:$R$101,2,FALSE)","v":32235},"FALSE means exact match"]
[1072615,{"$f":"VLOOKUP(A108,$F$2:$R$101,2,FALSE)","v":31691.000000000004}]
[1057220,29389.999999999996]
[1067179,57623]
[1041245,83600.999999999985]
[1062114,33498]
[1085115,29736]
[1077722,16795.999999999996]
[1056904,49898]
[]
["Column Index"]
["Half-Absolute Reference"]
[null,2,3,4,5,6,7,8,9,10,11,12,13]
["ID","Wage","Industry","Occupation","Ed","South","Nonwh","Hisp","Fe","Ex","Marr","Age","Union"]
[1006532,{"$f":"VLOOKUP($A121,$F$2:$R$101,B$119,FALSE)","v":32235},0,3,12,0,0,0,1,38,1,56,0]
[1072615,31691.000000000004,1,0,12,0,0,0,0,13,0,31,0]
[1057220,29389.999999999996,0,0,13,0,0,0,0,18,1,37,0]
[1067179,57623,0,1,15,0,0,0,0,31,1,52,0]
[1041245,83600.999999999985,0,5,17,0,0,1,0,18,1,41,0]
[1062114,33498,0,1,10,0,0,0,0,20,1,36,0]
[1085115,29736,0,4,8,0,0,1,0,47,1,61,1]
[1077722,16795.999999999996,0,4,12,0,0,0,1,14,1,32,0]
[1056904,49898,2,0,12,0,0,0,0,33,1,51,1]
[]
["Match(Lookup_value, Lookup_array, Match_type)"]
[null,{"$f":"MATCH(B133,$F$1:$R$1,0)","v":2},{"$f":"MATCH(C133,$F$1:$R$1,0)","v":5},{"$f":"MATCH(D133,$F$1:$R$1,0)","v":10},{"$f":"MATCH(E133,$F$1:$R$1,0)","v":12},{"$f":"MATCH(F133,$F$1:$R$1,0)","v":13}]
["ID","Wage","Ed","Ex","Age","Union"]
[1006532,{"$f":"VLOOKUP(A134,$F$1:$R$101,MATCH(B$133,$F$1:$R$1,0),0)","v":32235},{"$f":"VLOOKUP(A134,$F$1:$R$101,MATCH(C$133,$F$1:$R$1,0),0)","v":12}]
[1072615,{"$f":"VLOOKUP(A135,$F$1:$R$101,B$132,0)","v":31691.000000000004},{"$f":"VLOOKUP(A135,$F$1:$R$101,MATCH(C$133,$F$1:$R$1,0),0)","v":12}]
[1057220,29389.999999999996,13]
[1067179,57623,15]
[1041245,83600.999999999985,17]
[1062114,33498,10]
[1085115,29736,8]
[1077722,16795.999999999996,12]
[1056904,49898,12]

{"sheet":"Vlookup(difficult)","index":6,"n_rows":1625,"n_cols":33,"rows_kept":1625,"cut":false,"hidden":false,"merged":[]}
["state","Year","PerCapitaIncome"]
["Alabama",1973,null,null,null,null,null,null,null,null,null,null,null,null,null,{"$f":"VLOOKUP(A2,$A$1575:$AG$1625,MATCH(B2,$A$1573:$AG$1573,0))","v":16758.493243243243}]
["Alabama",1974]
["Alabama",1975]
["Alabama",1976]
["Alabama",1977]
["Alabama",1978]
["Alabama",1979]
["Alabama",1980]
["Alabama",1981]
["Alabama",1982]
["Alabama",1983]
["Alabama",1984]
["Alabama",1985]
["Alabama",1986]
["Alabama",1987]
["Alabama",1988]
["Alabama",1989]
["Alabama",1990]
["Alabama",1991]
["Alabama",1992]
["Alabama",1993]
["Alabama",1994]
["Alabama",1995]
["Alabama",1996]
["Alabama",1997]
["Alabama",1998]
["Alabama",1999]
["Alabama",2000]
["Alabama",2001]
["Alabama",2002]
["Alabama",2003]
["Alabama",2004]
["Alaska",1973]
["Alaska",1974]
["Alaska",1975]
["Alaska",1976]
["Alaska",1977]
["Alaska",1978]
["Alaska",1979]
["Alaska",1980]
["Alaska",1981]
["Alaska",1982]
["Alaska",1983]
["Alaska",1984]
["Alaska",1985]
["Alaska",1986]
["Alaska",1987]
["Alaska",1988]
["Alaska",1989]
["Alaska",1990]
["Alaska",1991]
["Alaska",1992]
["Alaska",1993]
["Alaska",1994]
["Alaska",1995]
["Alaska",1996]
["Alaska",1997]
["Alaska",1998]
["Alaska",1999]
["Alaska",2000]
["Alaska",2001]
["Alaska",2002]
["Alaska",2003]
["Alaska",2004]
["Arizona",1973]
["Arizona",1974]
["Arizona",1975]
["Arizona",1976]
["Arizona",1977]
["Arizona",1978]
["Arizona",1979]
["Arizona",1980]
["Arizona",1981]
["Arizona",1982]
["Arizona",1983]
["Arizona",1984]
["Arizona",1985]
["Arizona",1986]
["Arizona",1987]
["Arizona",1988]
["Arizona",1989]
["Arizona",1990]
["Arizona",1991]
["Arizona",1992]
["Arizona",1993]
["Arizona",1994]
["Arizona",1995]
["Arizona",1996]
["Arizona",1997]
["Arizona",1998]
["Arizona",1999]
["Arizona",2000]
["Arizona",2001]
["Arizona",2002]
["Arizona",2003]
["Arizona",2004]
["Arkansas",1973]
["Arkansas",1974]
["Arkansas",1975]
["Arkansas",1976]
["Arkansas",1977]
["Arkansas",1978]
["Arkansas",1979]
["Arkansas",1980]
["Arkansas",1981]
["Arkansas",1982]
["Arkansas",1983]
["Arkansas",1984]
["Arkansas",1985]
["Arkansas",1986]
["Arkansas",1987]
["Arkansas",1988]
["Arkansas",1989]
["Arkansas",1990]
["Arkansas",1991]
["Arkansas",1992]
["Arkansas",1993]
["Arkansas",1994]
["Arkansas",1995]
["Arkansas",1996]
["Arkansas",1997]
["Arkansas",1998]
["Arkansas",1999]
["Arkansas",2000]
["Arkansas",2001]
["Arkansas",2002]
["Arkansas",2003]
["Arkansas",2004]
["California",1973]
["California",1974]
["California",1975]
["California",1976]
["California",1977]
["California",1978]
["California",1979]
["California",1980]
["California",1981]
["California",1982]
["California",1983]
["California",1984]
["California",1985]
["California",1986]
["California",1987]
["California",1988]
["California",1989]
["California",1990]
["California",1991]
["California",1992]
["California",1993]
["California",1994]
["California",1995]
["California",1996]
["California",1997]
["California",1998]
["California",1999]
["California",2000]
["California",2001]
["California",2002]
["California",2003]
["California",2004]
["Colorado",1973]
["Colorado",1974]
["Colorado",1975]
["Colorado",1976]
["Colorado",1977]
["Colorado",1978]
["Colorado",1979]
["Colorado",1980]
["Colorado",1981]
["Colorado",1982]
["Colorado",1983]
["Colorado",1984]
["Colorado",1985]
["Colorado",1986]
["Colorado",1987]
["Colorado",1988]
["Colorado",1989]
["Colorado",1990]
["Colorado",1991]
["Colorado",1992]
["Colorado",1993]
["Colorado",1994]
["Colorado",1995]
["Colorado",1996]
["Colorado",1997]
["Colorado",1998]
["Colorado",1999]
["Colorado",2000]
["Colorado",2001]
["Colorado",2002]
["Colorado",2003]
["Colorado",2004]
["Connecticut",1973]
["Connecticut",1974]
["Connecticut",1975]
["Connecticut",1976]
["Connecticut",1977]
["Connecticut",1978]
["Connecticut",1979]
["Connecticut",1980]
["Connecticut",1981]
["Connecticut",1982]
["Connecticut",1983]
["Connecticut",1984]
["Connecticut",1985]
["Connecticut",1986]
["Connecticut",1987]
["Connecticut",1988]
["Connecticut",1989]
["Connecticut",1990]
["Connecticut",1991]
["Connecticut",1992]
["Connecticut",1993]
["Connecticut",1994]
["Connecticut",1995]
["Connecticut",1996]
["Connecticut",1997]
["Connecticut",1998]
["Connecticut",1999]
["Connecticut",2000]
["Connecticut",2001]
["Connecticut",2002]
["Connecticut",2003]
["Connecticut",2004]
["Delaware",1973]
["Delaware",1974]
["Delaware",1975]
["Delaware",1976]
["Delaware",1977]
["Delaware",1978]
["Delaware",1979]
["Delaware",1980]
["Delaware",1981]
["Delaware",1982]
["Delaware",1983]
["Delaware",1984]
["Delaware",1985]
["Delaware",1986]
["Delaware",1987]
["Delaware",1988]
["Delaware",1989]
["Delaware",1990]
["Delaware",1991]
["Delaware",1992]
["Delaware",1993]
["Delaware",1994]
["Delaware",1995]
["Delaware",1996]
["Delaware",1997]
["Delaware",1998]
["Delaware",1999]
["Delaware",2000]
["Delaware",2001]
["Delaware",2002]
["Delaware",2003]
["Delaware",2004]
["Florida",1973]
["Florida",1974]
["Florida",1975]
["Florida",1976]
["Florida",1977]
["Florida",1978]
["Florida",1979]
["Florida",1980]
["Florida",1981]
["Florida",1982]
["Florida",1983]
["Florida",1984]
["Florida",1985]
["Florida",1986]
["Florida",1987]
["Florida",1988]
["Florida",1989]
["Florida",1990]
["Florida",1991]
["Florida",1992]
["Florida",1993]
["Florida",1994]
["Florida",1995]
["Florida",1996]
["Florida",1997]
["Florida",1998]
["Florida",1999]
["Florida",2000]
["Florida",2001]
["Florida",2002]
["Florida",2003]
["Florida",2004]
["Georgia",1973]
["Georgia",1974]
["Georgia",1975]
["Georgia",1976]
["Georgia",1977]
["Georgia",1978]
["Georgia",1979]
["Georgia",1980]
["Georgia",1981]
["Georgia",1982]
["Georgia",1983]
["Georgia",1984]
["Georgia",1985]
["Georgia",1986]
["Georgia",1987]
["Georgia",1988]
["Georgia",1989]
["Georgia",1990]
["Georgia",1991]
["Georgia",1992]
["Georgia",1993]
["Georgia",1994]
["Georgia",1995]
["Georgia",1996]
["Georgia",1997]
["Georgia",1998]
["Georgia",1999]
["Georgia",2000]
["Georgia",2001]
["Georgia",2002]
["Georgia",2003]
["Georgia",2004]
["Idaho",1973]
["Idaho",1974]
["Idaho",1975]
["Idaho",1976]
["Idaho",1977]
["Idaho",1978]
["Idaho",1979]
["Idaho",1980]
["Idaho",1981]
["Idaho",1982]
["Idaho",1983]
["Idaho",1984]
["Idaho",1985]
["Idaho",1986]
["Idaho",1987]
["Idaho",1988]
["Idaho",1989]
["Idaho",1990]
["Idaho",1991]
["Idaho",1992]
["Idaho",1993]
["Idaho",1994]
["Idaho",1995]
["Idaho",1996]
["Idaho",1997]
["Idaho",1998]
["Idaho",1999]
["Idaho",2000]
["Idaho",2001]
["Idaho",2002]
["Idaho",2003]
["Idaho",2004]
["Illinois",1973]
["Illinois",1974]
["Illinois",1975]
["Illinois",1976]
["Illinois",1977]
["Illinois",1978]
["Illinois",1979]
["Illinois",1980]
["Illinois",1981]
["Illinois",1982]
["Illinois",1983]
["Illinois",1984]
["Illinois",1985]
["Illinois",1986]
["Illinois",1987]
["Illinois",1988]
["Illinois",1989]
["Illinois",1990]
["Illinois",1991]
["Illinois",1992]
["Illinois",1993]
["Illinois",1994]
["Illinois",1995]
["Illinois",1996]
["Illinois",1997]
["Illinois",1998]
["Illinois",1999]
["Illinois",2000]
["Illinois",2001]
["Illinois",2002]
["Illinois",2003]
["Illinois",2004]
["Indiana",1973]
["Indiana",1974]
["Indiana",1975]
["Indiana",1976]
["Indiana",1977]
["Indiana",1978]
["Indiana",1979]
["Indiana",1980]
["Indiana",1981]
["Indiana",1982]
["Indiana",1983]
["Indiana",1984]
["Indiana",1985]
["Indiana",1986]
["Indiana",1987]
["Indiana",1988]
["Indiana",1989]
["Indiana",1990]
["Indiana",1991]
["Indiana",1992]
["Indiana",1993]
["Indiana",1994]
["Indiana",1995]
["Indiana",1996]
["Indiana",1997]
["Indiana",1998]
["Indiana",1999]
["Indiana",2000]
["Indiana",2001]
["Indiana",2002]
["Indiana",2003]
["Indiana",2004]
["Iowa",1973]
["Iowa",1974]
["Iowa",1975]
["Iowa",1976]
["Iowa",1977]
["Iowa",1978]
["Iowa",1979]
["Iowa",1980]
["Iowa",1981]
["Iowa",1982]
["Iowa",1983]
["Iowa",1984]
["Iowa",1985]
["Iowa",1986]
["Iowa",1987]
["Iowa",1988]
["Iowa",1989]
["Iowa",1990]
["Iowa",1991]
["Iowa",1992]
["Iowa",1993]
["Iowa",1994]
["Iowa",1995]
["Iowa",1996]
["Iowa",1997]
["Iowa",1998]
["Iowa",1999]
["Iowa",2000]
["Iowa",2001]
["Iowa",2002]
["Iowa",2003]
["Iowa",2004]
["Kansas",1973]
["Kansas",1974]
["Kansas",1975]
["Kansas",1976]
["Kansas",1977]
["Kansas",1978]
["Kansas",1979]
["Kansas",1980]
["Kansas",1981]
["Kansas",1982]
["Kansas",1983]
["Kansas",1984]
["Kansas",1985]
["Kansas",1986]
["Kansas",1987]
["Kansas",1988]
["Kansas",1989]
["Kansas",1990]
["Kansas",1991]
["Kansas",1992]
["Kansas",1993]
["Kansas",1994]
["Kansas",1995]
["Kansas",1996]
["Kansas",1997]
["Kansas",1998]
["Kansas",1999]
["Kansas",2000]
["Kansas",2001]
["Kansas",2002]
["Kansas",2003]
["Kansas",2004]
["Kentucky",1973]
["Kentucky",1974]
["Kentucky",1975]
["Kentucky",1976]
["Kentucky",1977]
["Kentucky",1978]
["Kentucky",1979]
["Kentucky",1980]
["Kentucky",1981]
["Kentucky",1982]
["Kentucky",1983]
["Kentucky",1984]
["Kentucky",1985]
["Kentucky",1986]
["Kentucky",1987]
["Kentucky",1988]
["Kentucky",1989]
["Kentucky",1990]
["Kentucky",1991]
["Kentucky",1992]
["Kentucky",1993]
["Kentucky",1994]
["Kentucky",1995]
["Kentucky",1996]
["Kentucky",1997]
["Kentucky",1998]
["Kentucky",1999]
["Kentucky",2000]
["Kentucky",2001]
["Kentucky",2002]
["Kentucky",2003]
["Kentucky",2004]
["Louisiana",1973]
["Louisiana",1974]
["Louisiana",1975]
["Louisiana",1976]
["Louisiana",1977]
["Louisiana",1978]
["Louisiana",1979]
["Louisiana",1980]
["Louisiana",1981]
["Louisiana",1982]
["Louisiana",1983]
["Louisiana",1984]
["Louisiana",1985]
["Louisiana",1986]
["Louisiana",1987]
["Louisiana",1988]
["Louisiana",1989]
["Louisiana",1990]
["Louisiana",1991]
["Louisiana",1992]
["Louisiana",1993]
["Louisiana",1994]
["Louisiana",1995]
["Louisiana",1996]
["Louisiana",1997]
["Louisiana",1998]
["Louisiana",1999]
["Louisiana",2000]
["Louisiana",2001]
["Louisiana",2002]
["Louisiana",2003]
["Louisiana",2004]
["Maine",1973]
["Maine",1974]
["Maine",1975]
["Maine",1976]
["Maine",1977]
["Maine",1978]
["Maine",1979]
["Maine",1980]
["Maine",1981]
["Maine",1982]
["Maine",1983]
["Maine",1984]
["Maine",1985]
["Maine",1986]
["Maine",1987]
["Maine",1988]
["Maine",1989]
["Maine",1990]
["Maine",1991]
["Maine",1992]
["Maine",1993]
["Maine",1994]
["Maine",1995]
["Maine",1996]
["Maine",1997]
["Maine",1998]
["Maine",1999]
["Maine",2000]
["Maine",2001]
["Maine",2002]
["Maine",2003]
["Maine",2004]
["Maryland",1973]
["Maryland",1974]
["Maryland",1975]
["Maryland",1976]
["Maryland",1977]
["Maryland",1978]
["Maryland",1979]
["Maryland",1980]
["Maryland",1981]
["Maryland",1982]
["Maryland",1983]
["Maryland",1984]
["Maryland",1985]
["Maryland",1986]
["Maryland",1987]
["Maryland",1988]
["Maryland",1989]
["Maryland",1990]
["Maryland",1991]
["Maryland",1992]
["Maryland",1993]
["Maryland",1994]
["Maryland",1995]
["Maryland",1996]
["Maryland",1997]
["Maryland",1998]
["Maryland",1999]
["Maryland",2000]
["Maryland",2001]
["Maryland",2002]
["Maryland",2003]
["Maryland",2004]
["Massachusetts",1973]
["Massachusetts",1974]
["Massachusetts",1975]
["Massachusetts",1976]
["Massachusetts",1977]
["Massachusetts",1978]
["Massachusetts",1979]
["Massachusetts",1980]
["Massachusetts",1981]
["Massachusetts",1982]
["Massachusetts",1983]
["Massachusetts",1984]
["Massachusetts",1985]
["Massachusetts",1986]
["Massachusetts",1987]
["Massachusetts",1988]
["Massachusetts",1989]
["Massachusetts",1990]
["Massachusetts",1991]
["Massachusetts",1992]
["Massachusetts",1993]
["Massachusetts",1994]
["Massachusetts",1995]
["Massachusetts",1996]
["Massachusetts",1997]
["Massachusetts",1998]
["Massachusetts",1999]
["Massachusetts",2000]
["Massachusetts",2001]
["Massachusetts",2002]
["Massachusetts",2003]
["Massachusetts",2004]
["Michigan",1973]
["Michigan",1974]
["Michigan",1975]
["Michigan",1976]
["Michigan",1977]
["Michigan",1978]
["Michigan",1979]
["Michigan",1980]
["Michigan",1981]
["Michigan",1982]
["Michigan",1983]
["Michigan",1984]
["Michigan",1985]
["Michigan",1986]
["Michigan",1987]
["Michigan",1988]
["Michigan",1989]
["Michigan",1990]
["Michigan",1991]
["Michigan",1992]
["Michigan",1993]
["Michigan",1994]
["Michigan",1995]
["Michigan",1996]
["Michigan",1997]
["Michigan",1998]
["Michigan",1999]
["Michigan",2000]
["Michigan",2001]
["Michigan",2002]
["Michigan",2003]
["Michigan",2004]
["Minnesota",1973]
["Minnesota",1974]
["Minnesota",1975]
["Minnesota",1976]
["Minnesota",1977]
["Minnesota",1978]
["Minnesota",1979]
["Minnesota",1980]
["Minnesota",1981]
["Minnesota",1982]
["Minnesota",1983]
["Minnesota",1984]
["Minnesota",1985]
["Minnesota",1986]
["Minnesota",1987]
["Minnesota",1988]
["Minnesota",1989]
["Minnesota",1990]
["Minnesota",1991]
["Minnesota",1992]
["Minnesota",1993]
["Minnesota",1994]
["Minnesota",1995]
["Minnesota",1996]
["Minnesota",1997]
["Minnesota",1998]
["Minnesota",1999]
["Minnesota",2000]
["Minnesota",2001]
["Minnesota",2002]
["Minnesota",2003]
["Minnesota",2004]
["Mississippi",1973]
["Mississippi",1974]
["Mississippi",1975]
["Mississippi",1976]
["Mississippi",1977]
["Mississippi",1978]
["Mississippi",1979]
["Mississippi",1980]
["Mississippi",1981]
["Mississippi",1982]
["Mississippi",1983]
["Mississippi",1984]
["Mississippi",1985]
["Mississippi",1986]
["Mississippi",1987]
["Mississippi",1988]
["Mississippi",1989]
["Mississippi",1990]
["Mississippi",1991]
["Mississippi",1992]
["Mississippi",1993]
["Mississippi",1994]
["Mississippi",1995]
["Mississippi",1996]
["Mississippi",1997]
["Mississippi",1998]
["Mississippi",1999]
["Mississippi",2000]
["Mississippi",2001]
["Mississippi",2002]
["Mississippi",2003]
["Mississippi",2004]
["Missouri",1973]
["Missouri",1974]
["Missouri",1975]
["Missouri",1976]
["Missouri",1977]
["Missouri",1978]
["Missouri",1979]
["Missouri",1980]
["Missouri",1981]
["Missouri",1982]
["Missouri",1983]
["Missouri",1984]
["Missouri",1985]
["Missouri",1986]
["Missouri",1987]
["Missouri",1988]
["Missouri",1989]
["Missouri",1990]
["Missouri",1991]
["Missouri",1992]
["Missouri",1993]
["Missouri",1994]
["Missouri",1995]
["Missouri",1996]
["Missouri",1997]
["Missouri",1998]
["Missouri",1999]
["Missouri",2000]
["Missouri",2001]
["Missouri",2002]
["Missouri",2003]
["Missouri",2004]
["Montana",1973]
["Montana",1974]
["Montana",1975]
["Montana",1976]
["Montana",1977]
["Montana",1978]
["Montana",1979]
["Montana",1980]
["Montana",1981]
["Montana",1982]
["Montana",1983]
["Montana",1984]
["Montana",1985]
["Montana",1986]
["Montana",1987]
["Montana",1988]
["Montana",1989]
["Montana",1990]
["Montana",1991]
["Montana",1992]
["Montana",1993]
["Montana",1994]
["Montana",1995]
["Montana",1996]
["Montana",1997]
["Montana",1998]
["Montana",1999]
["Montana",2000]
["Montana",2001]
["Montana",2002]
["Montana",2003]
["Montana",2004]
["Nebraska",1973]
["Nebraska",1974]
["Nebraska",1975]
["Nebraska",1976]
["Nebraska",1977]
["Nebraska",1978]
["Nebraska",1979]
["Nebraska",1980]
["Nebraska",1981]
["Nebraska",1982]
["Nebraska",1983]
["Nebraska",1984]
["Nebraska",1985]
["Nebraska",1986]
["Nebraska",1987]
["Nebraska",1988]
["Nebraska",1989]
["Nebraska",1990]
["Nebraska",1991]
["Nebraska",1992]
["Nebraska",1993]
["Nebraska",1994]
["Nebraska",1995]
["Nebraska",1996]
["Nebraska",1997]
["Nebraska",1998]
["Nebraska",1999]
["Nebraska",2000]
["Nebraska",2001]
["Nebraska",2002]
["Nebraska",2003]
["Nebraska",2004]
["Nevada",1973]
["Nevada",1974]
["Nevada",1975]
["Nevada",1976]
["Nevada",1977]
["Nevada",1978]
["Nevada",1979]
["Nevada",1980]
["Nevada",1981]
["Nevada",1982]
["Nevada",1983]
["Nevada",1984]
["Nevada",1985]
["Nevada",1986]
["Nevada",1987]
["Nevada",1988]
["Nevada",1989]
["Nevada",1990]
["Nevada",1991]
["Nevada",1992]
["Nevada",1993]
["Nevada",1994]
["Nevada",1995]
["Nevada",1996]
["Nevada",1997]
["Nevada",1998]
["Nevada",1999]
["Nevada",2000]
["Nevada",2001]
["Nevada",2002]
["Nevada",2003]
["Nevada",2004]
["New Hampshire",1973]
["New Hampshire",1974]
["New Hampshire",1975]
["New Hampshire",1976]
["New Hampshire",1977]
["New Hampshire",1978]
["New Hampshire",1979]
["New Hampshire",1980]
["New Hampshire",1981]
["New Hampshire",1982]
["New Hampshire",1983]
["New Hampshire",1984]
["New Hampshire",1985]
["New Hampshire",1986]
["New Hampshire",1987]
["New Hampshire",1988]
["New Hampshire",1989]
["New Hampshire",1990]
["New Hampshire",1991]
["New Hampshire",1992]
["New Hampshire",1993]
["New Hampshire",1994]
["New Hampshire",1995]
["New Hampshire",1996]
["New Hampshire",1997]
["New Hampshire",1998]
["New Hampshire",1999]
["New Hampshire",2000]
["New Hampshire",2001]
["New Hampshire",2002]
["New Hampshire",2003]
["New Hampshire",2004]
["New Jersey",1973]
["New Jersey",1974]
["New Jersey",1975]
["New Jersey",1976]
["New Jersey",1977]
["New Jersey",1978]
["New Jersey",1979]
["New Jersey",1980]
["New Jersey",1981]
["New Jersey",1982]
["New Jersey",1983]
["New Jersey",1984]
["New Jersey",1985]
["New Jersey",1986]
["New Jersey",1987]
["New Jersey",1988]
["New Jersey",1989]
["New Jersey",1990]
["New Jersey",1991]
["New Jersey",1992]
["New Jersey",1993]
["New Jersey",1994]
["New Jersey",1995]
["New Jersey",1996]
["New Jersey",1997]
["New Jersey",1998]
["New Jersey",1999]
["New Jersey",2000]
["New Jersey",2001]
["New Jersey",2002]
["New Jersey",2003]
["New Jersey",2004]
["New Mexico",1973]
["New Mexico",1974]
["New Mexico",1975]
["New Mexico",1976]
["New Mexico",1977]
["New Mexico",1978]
["New Mexico",1979]
["New Mexico",1980]
["New Mexico",1981]
["New Mexico",1982]
["New Mexico",1983]
["New Mexico",1984]
["New Mexico",1985]
["New Mexico",1986]
["New Mexico",1987]
["New Mexico",1988]
["New Mexico",1989]
["New Mexico",1990]
["New Mexico",1991]
["New Mexico",1992]
["New Mexico",1993]
["New Mexico",1994]
["New Mexico",1995]
["New Mexico",1996]
["New Mexico",1997]
["New Mexico",1998]
["New Mexico",1999]
["New Mexico",2000]
["New Mexico",2001]
["New Mexico",2002]
["New Mexico",2003]
["New Mexico",2004]
["New York",1973]
["New York",1974]
["New York",1975]
["New York",1976]
["New York",1977]
["New York",1978]
["New York",1979]
["New York",1980]
["New York",1981]
["New York",1982]
["New York",1983]
["New York",1984]
["New York",1985]
["New York",1986]
["New York",1987]
["New York",1988]
["New York",1989]
["New York",1990]
["New York",1991]
["New York",1992]
["New York",1993]
["New York",1994]
["New York",1995]
["New York",1996]
["New York",1997]
["New York",1998]
["New York",1999]
["New York",2000]
["New York",2001]
["New York",2002]
["New York",2003]
["New York",2004]
["North Carolina",1973]
["North Carolina",1974]
["North Carolina",1975]
["North Carolina",1976]
["North Carolina",1977]
["North Carolina",1978]
["North Carolina",1979]
["North Carolina",1980]
["North Carolina",1981]
["North Carolina",1982]
["North Carolina",1983]
["North Carolina",1984]
["North Carolina",1985]
["North Carolina",1986]
["North Carolina",1987]
["North Carolina",1988]
["North Carolina",1989]
["North Carolina",1990]
["North Carolina",1991]
["North Carolina",1992]
["North Carolina",1993]
["North Carolina",1994]
["North Carolina",1995]
["North Carolina",1996]
["North Carolina",1997]
["North Carolina",1998]
["North Carolina",1999]
["North Carolina",2000]
["North Carolina",2001]
["North Carolina",2002]
["North Carolina",2003]
["North Carolina",2004]
["North Dakota",1973]
["North Dakota",1974]
["North Dakota",1975]
["North Dakota",1976]
["North Dakota",1977]
["North Dakota",1978]
["North Dakota",1979]
["North Dakota",1980]
["North Dakota",1981]
["North Dakota",1982]
["North Dakota",1983]
["North Dakota",1984]
["North Dakota",1985]
["North Dakota",1986]
["North Dakota",1987]
["North Dakota",1988]
["North Dakota",1989]
["North Dakota",1990]
["North Dakota",1991]
["North Dakota",1992]
["North Dakota",1993]
["North Dakota",1994]
["North Dakota",1995]
["North Dakota",1996]
["North Dakota",1997]
["North Dakota",1998]
["North Dakota",1999]
["North Dakota",2000]
["North Dakota",2001]
["North Dakota",2002]
["North Dakota",2003]
["North Dakota",2004]
["Ohio",1973]
["Ohio",1974]
["Ohio",1975]
["Ohio",1976]
["Ohio",1977]
["Ohio",1978]
["Ohio",1979]
["Ohio",1980]
["Ohio",1981]
["Ohio",1982]
["Ohio",1983]
["Ohio",1984]
["Ohio",1985]
["Ohio",1986]
["Ohio",1987]
["Ohio",1988]
["Ohio",1989]
["Ohio",1990]
["Ohio",1991]
["Ohio",1992]
["Ohio",1993]
["Ohio",1994]
["Ohio",1995]
["Ohio",1996]
["Ohio",1997]
["Ohio",1998]
["Ohio",1999]
["Ohio",2000]
["Ohio",2001]
["Ohio",2002]
["Ohio",2003]
["Ohio",2004]
["Oklahoma",1973]
["Oklahoma",1974]
["Oklahoma",1975]
["Oklahoma",1976]
["Oklahoma",1977]
["Oklahoma",1978]
["Oklahoma",1979]
["Oklahoma",1980]
["Oklahoma",1981]
["Oklahoma",1982]
["Oklahoma",1983]
["Oklahoma",1984]
["Oklahoma",1985]
["Oklahoma",1986]
["Oklahoma",1987]
["Oklahoma",1988]
["Oklahoma",1989]
["Oklahoma",1990]
["Oklahoma",1991]
["Oklahoma",1992]
["Oklahoma",1993]
["Oklahoma",1994]
["Oklahoma",1995]
["Oklahoma",1996]
["Oklahoma",1997]
["Oklahoma",1998]
["Oklahoma",1999]
["Oklahoma",2000]
["Oklahoma",2001]
["Oklahoma",2002]
["Oklahoma",2003]
["Oklahoma",2004]
["Oregon",1973]
["Oregon",1974]
["Oregon",1975]
["Oregon",1976]
["Oregon",1977]
["Oregon",1978]
["Oregon",1979]
["Oregon",1980]
["Oregon",1981]
["Oregon",1982]
["Oregon",1983]
["Oregon",1984]
["Oregon",1985]
["Oregon",1986]
["Oregon",1987]
["Oregon",1988]
["Oregon",1989]
["Oregon",1990]
["Oregon",1991]
["Oregon",1992]
["Oregon",1993]
["Oregon",1994]
["Oregon",1995]
["Oregon",1996]
["Oregon",1997]
["Oregon",1998]
["Oregon",1999]
["Oregon",2000]
["Oregon",2001]
["Oregon",2002]
["Oregon",2003]
["Oregon",2004]
["Pennsylvania",1973]
["Pennsylvania",1974]
["Pennsylvania",1975]
["Pennsylvania",1976]
["Pennsylvania",1977]
["Pennsylvania",1978]
["Pennsylvania",1979]
["Pennsylvania",1980]
["Pennsylvania",1981]
["Pennsylvania",1982]
["Pennsylvania",1983]
["Pennsylvania",1984]
["Pennsylvania",1985]
["Pennsylvania",1986]
["Pennsylvania",1987]
["Pennsylvania",1988]
["Pennsylvania",1989]
["Pennsylvania",1990]
["Pennsylvania",1991]
["Pennsylvania",1992]
["Pennsylvania",1993]
["Pennsylvania",1994]
["Pennsylvania",1995]
["Pennsylvania",1996]
["Pennsylvania",1997]
["Pennsylvania",1998]
["Pennsylvania",1999]
["Pennsylvania",2000]
["Pennsylvania",2001]
["Pennsylvania",2002]
["Pennsylvania",2003]
["Pennsylvania",2004]
["Rhode Island",1973]
["Rhode Island",1974]
["Rhode Island",1975]
["Rhode Island",1976]
["Rhode Island",1977]
["Rhode Island",1978]
["Rhode Island",1979]
["Rhode Island",1980]
["Rhode Island",1981]
["Rhode Island",1982]
["Rhode Island",1983]
["Rhode Island",1984]
["Rhode Island",1985]
["Rhode Island",1986]
["Rhode Island",1987]
["Rhode Island",1988]
["Rhode Island",1989]
["Rhode Island",1990]
["Rhode Island",1991]
["Rhode Island",1992]
["Rhode Island",1993]
["Rhode Island",1994]
["Rhode Island",1995]
["Rhode Island",1996]
["Rhode Island",1997]
["Rhode Island",1998]
["Rhode Island",1999]
["Rhode Island",2000]
["Rhode Island",2001]
["Rhode Island",2002]
["Rhode Island",2003]
["Rhode Island",2004]
["South Carolina",1973]
["South Carolina",1974]
["South Carolina",1975]
["South Carolina",1976]
["South Carolina",1977]
["South Carolina",1978]
["South Carolina",1979]
["South Carolina",1980]
["South Carolina",1981]
["South Carolina",1982]
["South Carolina",1983]
["South Carolina",1984]
["South Carolina",1985]
["South Carolina",1986]
["South Carolina",1987]
["South Carolina",1988]
["South Carolina",1989]
["South Carolina",1990]
["South Carolina",1991]
["South Carolina",1992]
["South Carolina",1993]
["South Carolina",1994]
["South Carolina",1995]
["South Carolina",1996]
["South Carolina",1997]
["South Carolina",1998]
["South Carolina",1999]
["South Carolina",2000]
["South Carolina",2001]
["South Carolina",2002]
["South Carolina",2003]
["South Carolina",2004]
["South Dakota",1973]
["South Dakota",1974]
["South Dakota",1975]
["South Dakota",1976]
["South Dakota",1977]
["South Dakota",1978]
["South Dakota",1979]
["South Dakota",1980]
["South Dakota",1981]
["South Dakota",1982]
["South Dakota",1983]
["South Dakota",1984]
["South Dakota",1985]
["South Dakota",1986]
["South Dakota",1987]
["South Dakota",1988]
["South Dakota",1989]
["South Dakota",1990]
["South Dakota",1991]
["South Dakota",1992]
["South Dakota",1993]
["South Dakota",1994]
["South Dakota",1995]
["South Dakota",1996]
["South Dakota",1997]
["South Dakota",1998]
["South Dakota",1999]
["South Dakota",2000]
["South Dakota",2001]
["South Dakota",2002]
["South Dakota",2003]
["South Dakota",2004]
["Tennessee",1973]
["Tennessee",1974]
["Tennessee",1975]
["Tennessee",1976]
["Tennessee",1977]
["Tennessee",1978]
["Tennessee",1979]
["Tennessee",1980]
["Tennessee",1981]
["Tennessee",1982]
["Tennessee",1983]
["Tennessee",1984]
["Tennessee",1985]
["Tennessee",1986]
["Tennessee",1987]
["Tennessee",1988]
["Tennessee",1989]
["Tennessee",1990]
["Tennessee",1991]
["Tennessee",1992]
["Tennessee",1993]
["Tennessee",1994]
["Tennessee",1995]
["Tennessee",1996]
["Tennessee",1997]
["Tennessee",1998]
["Tennessee",1999]
["Tennessee",2000]
["Tennessee",2001]
["Tennessee",2002]
["Tennessee",2003]
["Tennessee",2004]
["Texas",1973]
["Texas",1974]
["Texas",1975]
["Texas",1976]
["Texas",1977]
["Texas",1978]
["Texas",1979]
["Texas",1980]
["Texas",1981]
["Texas",1982]
["Texas",1983]
["Texas",1984]
["Texas",1985]
["Texas",1986]
["Texas",1987]
["Texas",1988]
["Texas",1989]
["Texas",1990]
["Texas",1991]
["Texas",1992]
["Texas",1993]
["Texas",1994]
["Texas",1995]
["Texas",1996]
["Texas",1997]
["Texas",1998]
["Texas",1999]
["Texas",2000]
["Texas",2001]
["Texas",2002]
["Texas",2003]
["Texas",2004]
["Utah",1973]
["Utah",1974]
["Utah",1975]
["Utah",1976]
["Utah",1977]
["Utah",1978]
["Utah",1979]
["Utah",1980]
["Utah",1981]
["Utah",1982]
["Utah",1983]
["Utah",1984]
["Utah",1985]
["Utah",1986]
["Utah",1987]
["Utah",1988]
["Utah",1989]
["Utah",1990]
["Utah",1991]
["Utah",1992]
["Utah",1993]
["Utah",1994]
["Utah",1995]
["Utah",1996]
["Utah",1997]
["Utah",1998]
["Utah",1999]
["Utah",2000]
["Utah",2001]
["Utah",2002]
["Utah",2003]
["Utah",2004]
["Vermont",1973]
["Vermont",1974]
["Vermont",1975]
["Vermont",1976]
["Vermont",1977]
["Vermont",1978]
["Vermont",1979]
["Vermont",1980]
["Vermont",1981]
["Vermont",1982]
["Vermont",1983]
["Vermont",1984]
["Vermont",1985]
["Vermont",1986]
["Vermont",1987]
["Vermont",1988]
["Vermont",1989]
["Vermont",1990]
["Vermont",1991]
["Vermont",1992]
["Vermont",1993]
["Vermont",1994]
["Vermont",1995]
["Vermont",1996]
["Vermont",1997]
["Vermont",1998]
["Vermont",1999]
["Vermont",2000]
["Vermont",2001]
["Vermont",2002]
["Vermont",2003]
["Vermont",2004]
["Virginia",1973]
["Virginia",1974]
["Virginia",1975]
["Virginia",1976]
["Virginia",1977]
["Virginia",1978]
["Virginia",1979]
["Virginia",1980]
["Virginia",1981]
["Virginia",1982]
["Virginia",1983]
["Virginia",1984]
["Virginia",1985]
["Virginia",1986]
["Virginia",1987]
["Virginia",1988]
["Virginia",1989]
["Virginia",1990]
["Virginia",1991]
["Virginia",1992]
["Virginia",1993]
["Virginia",1994]
["Virginia",1995]
["Virginia",1996]
["Virginia",1997]
["Virginia",1998]
["Virginia",1999]
["Virginia",2000]
["Virginia",2001]
["Virginia",2002]
["Virginia",2003]
["Virginia",2004]
["Washington",1973]
["Washington",1974]
["Washington",1975]
["Washington",1976]
["Washington",1977]
["Washington",1978]
["Washington",1979]
["Washington",1980]
["Washington",1981]
["Washington",1982]
["Washington",1983]
["Washington",1984]
["Washington",1985]
["Washington",1986]
["Washington",1987]
["Washington",1988]
["Washington",1989]
["Washington",1990]
["Washington",1991]
["Washington",1992]
["Washington",1993]
["Washington",1994]
["Washington",1995]
["Washington",1996]
["Washington",1997]
["Washington",1998]
["Washington",1999]
["Washington",2000]
["Washington",2001]
["Washington",2002]
["Washington",2003]
["Washington",2004]
["West Virginia",1973]
["West Virginia",1974]
["West Virginia",1975]
["West Virginia",1976]
["West Virginia",1977]
["West Virginia",1978]
["West Virginia",1979]
["West Virginia",1980]
["West Virginia",1981]
["West Virginia",1982]
["West Virginia",1983]
["West Virginia",1984]
["West Virginia",1985]
["West Virginia",1986]
["West Virginia",1987]
["West Virginia",1988]
["West Virginia",1989]
["West Virginia",1990]
["West Virginia",1991]
["West Virginia",1992]
["West Virginia",1993]
["West Virginia",1994]
["West Virginia",1995]
["West Virginia",1996]
["West Virginia",1997]
["West Virginia",1998]
["West Virginia",1999]
["West Virginia",2000]
["West Virginia",2001]
["West Virginia",2002]
["West Virginia",2003]
["West Virginia",2004]
["Wisconsin",1973]
["Wisconsin",1974]
["Wisconsin",1975]
["Wisconsin",1976]
["Wisconsin",1977]
["Wisconsin",1978]
["Wisconsin",1979]
["Wisconsin",1980]
["Wisconsin",1981]
["Wisconsin",1982]
["Wisconsin",1983]
["Wisconsin",1984]
["Wisconsin",1985]
["Wisconsin",1986]
["Wisconsin",1987]
["Wisconsin",1988]
["Wisconsin",1989]
["Wisconsin",1990]
["Wisconsin",1991]
["Wisconsin",1992]
["Wisconsin",1993]
["Wisconsin",1994]
["Wisconsin",1995]
["Wisconsin",1996]
["Wisconsin",1997]
["Wisconsin",1998]
["Wisconsin",1999]
["Wisconsin",2000]
["Wisconsin",2001]
["Wisconsin",2002]
["Wisconsin",2003]
["Wisconsin",2004]
["Wyoming",1973]
["Wyoming",1974]
["Wyoming",1975]
["Wyoming",1976]
["Wyoming",1977]
["Wyoming",1978]
["Wyoming",1979]
["Wyoming",1980]
["Wyoming",1981]
["Wyoming",1982]
["Wyoming",1983]
["Wyoming",1984]
["Wyoming",1985]
["Wyoming",1986]
["Wyoming",1987]
["Wyoming",1988]
["Wyoming",1989]
["Wyoming",1990]
["Wyoming",1991]
["Wyoming",1992]
["Wyoming",1993]
["Wyoming",1994]
["Wyoming",1995]
["Wyoming",1996]
["Wyoming",1997]
["Wyoming",1998]
["Wyoming",1999]
["Wyoming",2000]
["Wyoming",2001]
["Wyoming",2002]
["Wyoming",2003]
["Wyoming",2004]
[]
[]
[]
[null,1973,1974,1975,1976,1977,1978,1979,1980,1981,1982,1983,1984,1985,1986,1987,1988,1989,1990,1991,1992,1993,1994,1995,1996,1997,1998,1999,2000,2001,2002,2003,2004]
["United States",22255.313063063066,21867.186612576068,21670.832713754648,22422.330404217926,23082.582508250824,23887.737730061352,23797.236914600555,23186.099514563106,23370.400440044003,23362.917098445596,23931.126506024098,25255.148219441769,25908.7936802974,26614.906934306571,27004.718309859156,27673.929839391378,28213.129032258064,28150.002295332826,27588.831130690167,28077.837491090519,27904.909342560553,28261.071524966268,28602.732283464567,29105.52899936265,29816.776323987538,31154.593251533741,31678.734093637457,32739.375725900121,32611.115753811406,32351.356309060589,32322.432608695653,33050]
["Alabama",16758.493243243243,16598.677484787022,16730.641263940521,17635.093145869949,18057.717821782178,18719.062883435585,18569.962809917361,17963.839805825242,18033.819581958196,17946.478756476685,18556.200803212854,19640.872954764196,20304.994423791821,20965.142335766424,21327.741197183099,21872.799661876586,22645.149193548386,22724.366488140782,22753.989720998536,23329.082679971489,23222.280968858133,23715.744939271259,24097.145013123358,24176.551306564692,24633.501557632397,25524.677914110427,25763.420168067227,26068.638792102211,26363.869565217392,26680.156197887718,27027.072826086958,27695]
["Alaska",29028.484234234234,31220.227180527389,37509.641263940524,40253.295254833043,38668.391089108911,36218.388036809818,34394.891184573011,34079.944174757278,34432.168316831681,36288.375129533677,36365.146586345385,35458.293551491814,35675.064126394056,34138.159671532849,32187.828345070426,31787.255283178361,32947.816129032261,32958.497322111711,32122.708516886938,32025.483962936563,32077.703806228375,31929.453441295551,31612.241469816272,31067.970044614402,31493.925856697817,31939.165644171779,31861.284513805524,32763.509291521492,33823.872953133825,33961.048916064479,33902.416847826091,34000]
["Arizona",20919.39864864865,20349.855983772821,19469.340148698884,20154.866432337436,20651.196369636964,21833.595092024541,22163.225895316809,21833.538834951454,22102.754675467546,21403.446632124353,22138.852409638559,23427.963426371509,24172.528810408923,24865.513686131388,24917.838908450707,24953.00338123415,24988.118548387098,24577.234123947972,23938.428781204115,23934.962936564505,23913.824913494809,24488.170040485835,24702.021653543306,25069.883365200763,25729.239252336447,26904.922699386501,27277.114645858346,28148.513356562144,27965.946357989837,27833.086714841578,27923.321195652174,28658]
["Arkansas",16877.619369369371,16702.131845841788,16376.014869888477,17107.235500878734,17627.549504950493,18733.549079754601,18260.333333333336,17248.587378640776,17711.712871287127,17500.165803108808,18000.501004016067,19219.075072184791,19767.788104089221,20182.655109489053,20095.567781690144,20600.159763313612,20993.797580645161,20898.959449120124,20975.944199706319,21823.806842480397,21725.460899653979,22114.811066126858,22405.225721784776,22785.987253027404,23056.392523364484,23744.614110429447,23966.262304921969,24051.292102206742,24557,24531.799332962757,24976.891847826089,25814]
["California",25288.774774774774,25104.924949290064,25031.005576208179,25977.899824253076,26714.075907590759,27755.552147239265,27978.53581267218,27397.377427184463,27379.070407040701,26941.250777202073,27606.710843373497,29078.600577478344,29767.550185873606,30451.507299270077,30844.243838028171,31295.444632290786,31358.923387096776,31273.283856159145,30165.748898678419,30283.241625089093,29589.975778546715,29575.213900134957,29947.59120734908,30474.421924792859,31177.327102803738,32882.506748466258,33820.583433373351,35611.270034843212,35072.895539243364,34444.061700944971,34289.456521739128,35219]
["Colorado",22531.855855855858,22407.448275862072,22236.128252788105,22873.831282952549,23522.102310231021,24597.561349693253,24749.542699724523,24634.944174757278,25209.525852585259,25359.580310880829,25801.160642570285,26867.797882579402,27102.585501858739,27207.804744525551,27062.918133802817,27352.975486052412,28205.512096774193,28291.64116296863,27960.528634361239,28421.169636493229,28830.453979238755,29321.562753036444,30028.158792650916,30785.04142766093,31596.320249221182,33357.65398773006,34573.462184873948,36607.328106852503,36791.234895539244,35729.295719844362,35447.495652173915,36113]
["Connecticut",26505.563063063066,26043.677484787022,25480.43308550186,26170.451669595783,27097.486798679867,27987.331288343557,28264.747933884304,28328.122572815533,28736.074807480745,29141.495336787564,29973.650602409642,31947.553416746869,32883.697955390337,34512.167883211681,36152.067781690144,37978.001690617079,39126.674193548388,38306.087222647286,36770.314243759181,38186.61297220242,37878.044982698964,37847.555330634284,38480.318241469817,39036.925430210322,40457.554517133955,42672.857668711658,43462.873949579836,45512.61382113822,45790.383963862223,44631.431350750419,43829.933152173915,45318]
["Delaware",24922.887387387389,24277.29006085193,23672.189591078069,24391.007029876979,24609.991749174915,24965.51073619632,24666.280991735541,24639.529126213591,24586.093509350932,24807.561658031089,25600.122489959842,26893.251203079883,28066.3968401487,28793.461678832118,29482.367957746483,30348.549450549453,31599.618548387098,30961.100229533284,30637.305433186495,30522.900926585888,30023.98823529412,29992.017543859653,30252.508530183724,30974.061822817079,31159.672897196262,32741.121472392639,32796.713685474191,33862.683507549365,34244.12478825522,34572.165091717623,34671.363043478261,35728]
["District of Columbia",27535.153153153155,27794.738336713999,28222.643122676582,28989.012302284711,30071.25907590759,30047.268404907976,29235.267217630859,28176.819174757278,28093.939493949394,28867.443523316062,29378.122489959842,31085.776708373432,31860.197026022306,32769.668795620441,33491.504401408456,35565.255283178361,36763.900806451617,38261.283091048201,38233.52643171807,38932.518888096936,39212.764013840831,39303.18151147099,38754.248031496063,39472.755895474824,40590.549532710276,42159.466871165641,41986.596638655465,44379.433217189326,47821.245623941271,47954.769316286831,48988.751086956523,51155]
["Florida",22238.295045045044,21453.369168357,20754.421933085501,21144.184534270651,21764.023102310231,22728.842024539877,22735.65013774105,22771.161407766987,23148.042904290429,22932.264248704665,24001.300200803216,25056.975938402309,25803.459107806691,26608.012773722628,27026.335387323947,27745.785291631448,28694.519354838711,28275.742922723795,27433.494860499271,27489.460441910192,27517.958477508651,27616.109311740896,28125.524278215224,28479.474187380496,28837.556386292836,30116.222699386501,30493.857142857145,31273.810104529621,31223.431394692263,31195.275708727073,30930.321739130435,31469]
["Georgia",19064.434684684686,18591.131845841788,18107.013011152416,18883.36028119508,19329.519801980197,20138.710122699387,19928.169421487608,19302.64563106796,19552.916391639163,19690.622797927463,20623.479919678717,22197.113570741098,23063.004646840149,24077.855839416061,24478.845950704228,25130.246830092987,25442.087903225809,25441.52027543994,25061.842878120417,25682.590876692801,25777.986851211073,26398.838731444001,26868.669947506562,27624.668578712553,28005.454828660437,29295.724539877301,29887.245498199281,30703.380371660864,30497.057029926593,29971.99332962757,29429.388043478262,29782]
["Hawaii",26135.421171171172,26545.622718052742,26014.128252788105,26197.010544815468,26037.651815181518,26405.438650306747,26297.690082644633,26232.799757281551,25525.398239823982,25044.420725388602,26381.516064257034,27153.238691049082,27541.479553903348,28226.416970802922,28629.324823943665,29813.625528317836,31261.426612903226,32065.305279265496,31753.784875183559,32433.443335709195,32099.927335640139,31581.479757085024,30992.490813648292,30127.683875079667,30114.543925233644,30284.262576687117,30583.431572629055,31178.372822299658,30663.451157538115,30938.018899388549,31349.186956521742,32625]
["Idaho",19898.317567567567,20464.805273833674,19522.00743494424,20211.304042179261,20164.91914191419,20976.012269938652,20266.420110192841,19825.330097087379,19507.198019801977,18833.232124352333,19591.736947791167,20133.576515880653,20436.662639405204,20594.581204379563,20875.445422535213,21545.458157227389,22437.968548387096,22725.811782708493,22232.503671071958,23014.024946543122,23665.44429065744,23844.482456140355,24078.552493438317,24377.611217335882,24301.602492211838,25251.178527607361,25835.98679471789,26409.799651567948,26685.991530208921,26444.949972206781,26004.54891304348,26877]
["Illinois",25080.304054054057,24725.592292089252,24616.689591078069,25307.288224956064,26078.174917491746,26729.929447852763,26414.776859504138,25228.695388349512,25344.602860286028,25293.024870466321,25526.155622489965,27040.516843118381,27494.078996282529,28307.423357664236,28845.495598591551,29721.011834319528,30117.362903225807,30096.814078041316,29423.740822320124,30361.332858161084,30017.451903114186,30551.57962213226,31139.991469816272,31843.314850223072,32635.564485981307,34005.476687116563,34255.983193277316,35306.309523809534,34699.575381140596,34513.363535297387,34653.91032608696,34721]
["Indiana",21595.864864864867,20752.178498985802,20480.552044609667,21579.08611599297,22328.229372937294,23018.565950920245,22707.028925619838,21489.667475728154,21419.057205720572,20923.855958549222,21268.319277108436,22658.909528392684,23101.627323420074,23819.324817518249,24259.349471830988,24705.501267962809,25466.462096774194,25279.64728385616,24783.069750367111,25631.427655024945,25836.813840830451,26462.570175438599,26535.244094488189,26929.988527724665,27429.927725856698,28849.549693251534,29043.658463385356,29763.268292682933,29232.035008469789,29424.928849360756,29646.007065217393,30204]
["Iowa",22982.833333333336,21422.716024340774,21835.856877323422,21851.314586994729,22615.008250825082,24249.89263803681,23388.734159779618,21973.37985436893,22559.938393839384,22012.233160621763,21905.572289156629,23427.963426371509,23682.723048327138,24315.704379562045,24784.810739436623,24464.386306001692,25282.132258064517,25132.227237949504,24692.919236417038,25358.108339272985,24466.798615916956,25876.240890688263,25941.522965879263,27114.193116634797,27803.019937694702,28625.882822085889,28480.133253301323,29129.213704994199,28912.046301524562,29485.830461367426,29336.991304347826,31058]
["Kansas",22425.493243243243,21867.186612576068,21783.189591078069,22286.216168717048,22696.054455445545,23238.756134969324,23745.198347107442,22817.010922330097,23322.603960396038,23631.096373056997,23728.191767068278,24955.162656400382,25369.831784386617,25861.719890510951,25938.830105633806,25987.721893491125,25970.703225806454,26138.152257077276,25832.976505139504,26513.320028510334,26451.229065743944,26754.460188933877,26721.169291338581,27504.273422562139,28294.983800623053,29532.139263803681,29701.293517406964,30379.771196283396,30631.452286843589,30429.805447470819,30488.870652173915,31078]
["Kentucky",17541.322072072071,17571.914807302233,17327.53717472119,18099.873462214411,18924.288778877886,19556.365030674846,19769.451790633611,18747.866504854366,18852.594059405939,18852.807253886011,18804.653614457835,20239.025986525503,20419.106877323422,20794.511861313869,21296.147007042255,21658.830092983939,22259.732258064516,22311.012241775057,22415.578560939797,23124.429793300071,22903.307958477508,23230.111336032391,23400.54527559055,23903.254302103251,24545.230529595014,25545.538036809816,25809.908163265307,26779.481997677125,26580.395256916996,26674.906058921624,26642.086413043478,27265]
["Louisiana",16928.673423423425,17238.561866125761,17429.36059479554,18441.818980667838,19064.561056105609,20028.615030674846,20162.342975206615,20121.059466019415,20808.093509350932,20671.336787564767,20667.101405622492,21215.342637151105,21265.294609665427,20691.099452554747,20306.75,20815.726120033814,21290.858064516131,21929.454475899005,22052.202643171811,22580.483962936563,22763.430449826992,23467.192307692312,23645.966535433068,23821.385595920969,24340.441744548287,25231.477300613496,24960.651860744299,25317.207317073175,26337.20383963862,26454.40022234575,26566.115760869565,27297]
["Maine",18332.659909909911,18196.472616632862,17657.585501858735,18929.838312829525,19080.146864686467,19434.680981595091,19311.512396694219,19135.294902912621,19104.045104510449,19428.316062176167,20060.193775100404,21248.068334937438,22043.014869888477,23257.450729927008,24187.846830985916,25085.536770921386,25597.473387096776,25113.438408569244,24307.352422907494,24575.849607982895,24366.139100346023,24711.23009446694,24963.556430446191,25527.38495857234,26103.508411214953,27345.303067484663,27761.27010804322,28487.480255516846,29110.439299830603,29144.571428571431,29255.887500000001,30046]
["Maryland",24705.907657657659,24407.565922920894,24202.373605947956,25021.780316344466,25495.265676567655,26159.173312883435,25959.439393939399,25645.925970873785,25743.599559955994,26203.268393782382,27191.358433734942,28731.344562078921,29965.930297397772,31140.923357664236,31940.063380281692,32865.087066779379,33362.177419354841,33027.871461361901,32321.039647577098,32500.763364219529,32315.626297577855,32613.929149797576,32714.15813648294,32979.845124282983,33738.363862928345,35134.24110429448,36052.007202881156,37579.252613240424,38000.792207792205,38360.665369649811,38419.590760869563,39631]
["Massachusetts",23599.736486486487,23051.164300202843,22678.533457249072,23232.376098418277,23752.772277227723,24423.726993865032,24419.097796143255,24304.827669902912,24517.515951595156,25332.17512953368,26569.278112449803,28585.897016361883,29686.7936802974,31278.806569343069,32550.330105633806,34077.049027895184,34035.514516129035,33303.922723794953,32498.566813509551,33037.977191732003,32911.739792387547,33526.563427800276,34032.987532808394,34833.930528999364,35894.530841121494,37691.923926380368,38808.405162064832,41417.586527293854,41548.400338791638,40935.333518621461,40857.838043478259,42176]
["Michigan",23612.5,22694.821501014201,22141.327137546468,23544.442882249561,24787.669966996698,25498.602760736198,25069.579889807166,23644.594660194172,23062.840484048404,22589.699481865286,23365.943775100404,24818.805582290661,25935.127323420074,26899.291058394163,26693.764964788734,27190.103127641589,27763.729838709678,27347.863810252489,26801.054331864911,27383.094796863861,27621.232525951556,28926.42780026991,29138.196850393699,29263.246653919694,29855.615576323988,31196.313496932515,31855.615246098441,32417.960511033689,31941.272727272728,31739.190105614231,32423.042391304349,32079]
["Minnesota",23033.887387387389,22281.004056795133,21849.901486988849,22302.815465729349,23481.579207920789,24383.165644171779,24229.157024793392,23511.631067961163,23480.540154015402,23599.776165803109,24082.853413654622,26089.65351299326,26625.068773234201,27502.530109489053,28078.92077464789,27961.351648351651,28827.054032258064,28748.354246365725,28124.186490455217,28870.867426942266,28284.016608996542,29297.344804318494,29844.712598425194,30960.818355640535,31722.253582554516,33599.863190184049,34135.794717887155,35122.016840882701,34789.17221908526,34899.773763201782,35168.252173913046,36184]
["Mississippi",15277.925675675677,14993.219066937121,14757.373605947956,15749.413005272409,16308.990099009899,16705.481595092024,16873.505509641876,16063.377427184465,16311.068206820681,16125.99170984456,16265.12449799197,17120.994225216553,17366.159851301116,17569.768248175184,17962.12852112676,18460.464074387153,19034.721774193549,18917.460596786535,19003.72834067548,19602.245901639344,19988.103806228373,20764.979082321192,20928.97965879265,21312.350541746335,21832.367601246104,22650.616564417178,22737.165066026413,23042.070267131247,23417.840203274984,23437.670372429129,23890.716847826086,24518]
["Missouri",20978.961711711712,20204.253549695743,20210.193308550188,20944.992970123025,21770.257425742573,22447.809815950921,22457.243801652898,21375.043689320388,21639.336633663366,21777.331606217616,22455.582329317273,23811.581328200191,24511.355018587361,25155.068430656938,25340.203345070426,25558.185967878275,25879.3,25476.207345065035,25454.344346549198,26051.504632929435,25964.925951557096,26573.462887989208,26722.408792650916,27146.699808795409,27912.476012461058,28883.157668711654,29136.634453781513,29882.839140534266,29661.886504799546,29776.688160088939,29987.875,30475]
["Montana",21217.213963963964,20514.616632860045,20371.706319702604,20553.249560632688,20626.25907590759,22163.880368098158,21317.599173553725,20765.245145631066,21225.79317931793,20855.343005181348,20989.521084337353,21282.612127045235,20907.157063197028,21492.545620437959,21580.494718309859,21230.890955198647,22303.910483870968,22326.910482019895,22631.939794419974,22709.738417676406,23230.124567474049,22766.146423751692,22743.609580052493,22931.665391969407,23394.17632398754,24487.466257668711,24474.228691476594,25152.66027874565,26320.137775268209,26318.946637020566,26874.104891304349,27657]
["Nebraska",22382.948198198199,20878.622718052742,21691.899628252788,21369.934973637963,21692.328382838281,23264.831288343557,22498.874655647385,20999.077669902912,22013.396039603958,22256.922279792747,22301.958835341367,23833.398460057746,24348.086431226766,24703.500912408763,24995.992957746483,25499.104818258664,25630.987903225807,25990.73221117062,25691.509544787081,26051.504632929435,25818.512110726646,26449.823886639679,26934.363517060367,28328.98024219248,28318.522741433022,29600.514110429449,30007.433973589439,30304.079558652735,30593.053642010163,30641.911061700946,31565.805978260873,32341]
["Nevada",25982.259009009009,24871.19472616633,24729.046468401488,25712.31107205624,26598.740924092406,28175.651840490798,27739.158402203862,26821.966019417472,26500.030803080306,25745.210362694303,25899.783132530123,26576.90279114533,27178.075278810411,27869.644160583943,28044.000880281692,29010.441251056636,29492.774193548386,29405.963274674828,28794.074155653456,29733.91019244476,29775.607612456748,30300.477732793526,30760.70406824147,31405.076481835564,31615.15140186916,32750.39263803681,33090.381752701083,33388.788037166094,32774.309994353469,32273.654252362427,32793.655978260867,33787]
["New Hampshire",20719.436936936938,20181.263691683573,19690.54275092937,20765.720562390157,21424.252475247522,22421.734662576688,22636.776859504138,22580.885922330097,22902.826182618261,23509.730569948188,24777.00401606426,26447.818094321461,27764.437732342009,29267.435218978106,30365.342429577468,31237.960270498734,31191.350806451614,29645.882172915073,29387.680616740094,29623.505345687812,29251.393771626299,30090.163967611341,30675.178477690286,31816.827915869981,32080.045482866044,33778.333128834354,34446.470588235294,36634.752613240424,36124.591756070018,35746.096164535855,35418.75,36616]
["New Jersey",25667.425675675677,25158.567951318462,24778.202602230485,25576.196836555362,26327.547854785476,27118.159509202455,27005.414600550968,26838.01334951456,27067.35423542354,27479.56683937824,28611.901606425708,30176.72954764196,31075.454460966543,32338.78375912409,33479.864436619719,35110.1707523246,35779.792741935482,35513.778117827089,34461.074155653456,35520.739843193158,35066.114878892731,35126.222672064781,35872.407480314956,36684.404079031228,37722.329595015573,39535.726993865028,39928.652460984398,42084.550522648089,41756.392998306037,41261.892162312397,40680.230978260872,41626]
["New Mexico",17537.067567567567,17445.470588235297,17745.364312267659,18335.583479789104,18902.468646864687,19707.021472392636,19641.957300275484,19133.002427184463,19359.652365236521,19461.593782383421,19851.569277108436,20571.737247353223,21207.36059479554,21201.267335766424,21109.907570422536,21230.890955198647,21446.243548387098,21569.57612853864,21670.796622613805,21909.976478973629,22169.931487889273,22472.981781376522,22839.051181102361,22909.994263862332,23183.502803738316,23938.149693251533,23858.546218487398,24280.560975609762,25689.76002258611,25458.973874374653,25554.884782608697,26184]
["New York",25373.864864864867,24809.888438133876,24479.754646840149,24805.989455184535,25367.462046204619,25866.552147239265,25563.946280991739,25251.620145631066,25620.991199119911,26248.291191709846,27077.563253012053,28813.158806544754,29628.85966542751,30947.886861313873,31785.418133802821,33176.460693153,33950.20483870968,33997.664116296866,33237.801027900154,33480.942979330008,32868.6,32866.305668016197,33568.174540682412,34221.119184193754,35140.107788161993,36568.953987730063,37208.537815126052,38281.319976771207,37984.792772444947,37125.832684824905,36901.204347826089,38264]
["North Carolina",18502.840090090092,18123.671399594321,17717.275092936805,18521.495606326891,18827.656765676566,19538.981595092024,19262.07575757576,18786.838592233009,19031.311331133111,19027.025906735751,19965.364457831329,21529.872954764196,22294.062267657995,23235.0447080292,23788.762323943665,24587.338968723587,25131.316935483872,24925.550114766644,24516.779001468432,25368.879543834639,25589.740484429065,26002.429149797576,26395.180446194223,26872.198852772464,27693.563862928349,28674.556441717792,28981.296518607443,29693.061556329856,29324.831733483905,28886.264591439689,28600.897282608697,29322]
["North Dakota",26331.12837837838,23426.665314401627,22341.46282527881,20526.690685413007,19977.889438943894,23415.487730061352,21515.345730027551,18126.605582524269,21487.634763476348,21603.112953367876,21677.981927710847,22468.009624639075,22587.243494423794,22642.14689781022,22779.411091549297,20328.705832628912,22008.373387096774,23042.331293037492,22582.010279001472,23789.55167498218,23142.537716262977,24225.596491228072,23383.192257217848,25364.851497769279,24346.32647975078,26506.262576687117,26282.725090036016,27540.786295005812,27603.292490118576,27749.084491384103,29595.702173913043,29494]
["Ohio",22157.45945945946,21920.829614604467,21421.540892193309,22409.050966608087,23356.892739273924,23997.832822085889,23875.294765840226,23030.211165048542,22767.749174917491,22511.398963730571,23140.25,24522.456207892203,25145.118029739777,25775.542883211681,25960.447183098593,26560.968723584108,27059.924999999999,27089.156082631984,26490.381791483116,27011.488239486815,26974.135640138411,27674.742240215928,27882.582020997375,28078.558317399616,29018.806230529593,30150.989570552145,30454.172268907565,30942.522067363538,30506.656691134951,30673.411895497498,30751.688043478262,31161]
["Oklahoma",19221.851351351354,19070.087221095338,19300.804832713755,19846.119507908614,20504.689768976896,21288.914110429447,21864.00413223141,21792.274271844657,22788.530253025299,23163.250777202073,22334.200803212854,23147.976900866215,23405.342007434945,22938.59580291971,22362.035211267608,22699.935756551142,23265.167741935486,23394.983167559298,22959.255506607933,23395.056307911618,23287.644290657441,23420.031039136305,23378.234251968504,23769.615678776288,24328.6722741433,25224.523926380367,25587.67286914766,26773.99709639954,27748.35403726708,27154.768760422459,27267.304347826088,27840]
["Oregon",21740.518018018018,21855.691683569981,21734.033457249072,22916.989455184535,23475.344884488448,24383.165644171779,24221.351239669424,23183.807038834948,22495.51705170517,21794.949222797928,22510.583333333336,23420.691049085657,23775.768587360595,24384.645985401461,24625.176936619722,25307.49027895182,25973.75,26029.755164498853,25695.670337738626,25898.014967925872,26205.462975778548,26843.68421052632,27632.20275590551,28170.058636073933,28798.717133956387,29600.514110429449,30024.441776710686,30821.854239256685,30406.39356295878,30371.003891050586,29937.570108695654,30561]
["Pennsylvania",21944.734234234234,21813.543610547669,21712.966542750932,22571.724077328647,23310.135313531351,23939.888036809818,23799.838842975212,23119.6177184466,23166.745874587457,23341.384455958549,23697.846385542172,24646.086621751681,25362.809479553904,26175.404197080294,26692.102112676057,27453.573119188506,28339.570161290325,28453.514154552413,28106.156387665204,28590.816108339273,28417.357785467128,28569.531713900138,28833.279527559054,29308.99681325685,29982.72585669782,31244.987116564418,31676.466386554624,32574.828687572597,32298.593450028231,32567.662034463592,32612.969021739133,33312]
["Rhode Island",21110.851351351354,20664.050709939151,20564.819702602232,21273.659050966609,21767.140264026402,22146.496932515336,22142.410468319562,22184.287621359221,22379.14301430143,22640.594818652851,23578.361445783135,24916.982675649662,25657.746282527882,26759.684306569347,27407.128521126764,28814.03634826712,29776.124193548389,28914.563121652642,27806.579295154188,28095.340698503205,28218.653287197234,28165.474358974363,28787.417979002625,29022.456341618865,29825.014953271027,30907.748466257668,31134.484393757506,32047.181184668996,32731.644833427443,33052.774874930517,33323.397282608697,34207]
["South Carolina",17090.344594594597,17050.811359026371,16611.262081784389,17449.181019332162,17671.189768976896,18261.299079754601,18187.479338842979,17750.639563106794,17911.21122112211,17791.835233160622,18597.925702811248,19899.042348411935,20480.552044609667,21087.513686131388,21563.866197183099,22233.673710904481,22643.625806451615,22971.511859219587,22525.146108663732,22825.528866714183,22917.687889273358,23408.559379217277,23704.223097112859,24148.860420650093,24700.58753894081,25682.287730061347,26163.670468187276,26792.645760743326,26659.325804630153,26629.754863813232,26663.645652173913,27185]
["South Dakota",21944.734234234234,19805.762677484789,19974.946096654276,18544.734622144115,19759.688118811879,21112.182515337423,20940.319559228654,18507.156553398057,19611.103410341031,19520.319170984458,19546.218875502011,21273.521655437919,21117.826208178438,21678.687956204383,22034.453345070426,21903.13863060017,22450.155645161292,23373.303749043611,23264.380323054334,23964.58374910905,23908.595847750865,24717.603238866403,24171.515091863515,25870.511153601019,25832.81059190031,27220.142331288342,27751.065426170469,28214.332171893151,28744.585544889891,28442.102834908284,29876.998913043481,30209]
["Tennessee",18209.279279279279,17932.089249492903,17640.029739776954,18484.977152899824,18974.163366336634,19866.369631901842,19649.763085399452,18933.557038834952,19041.701870187018,19064.21865284974,19589.840361445786,20935.356111645811,21588.320631970262,22466.34580291971,23088.701584507045,23721.879966187658,24119.787903225806,24124.856924254018,23991.132158590313,25012.083392729863,25209.325951557094,25789.566126855603,26245.200787401573,26311.157425111534,26688.451090342678,27800.749079754602,28230.685474189679,28627.893728223004,28660.321852060981,28865.264035575321,29197.369565217392,29844]
["Texas",19847.263513513513,19832.58417849899,20178.592936802976,21097.706502636203,21676.742574257423,22772.300613496933,23003.648760330583,22649.660194174754,23574.055005500548,23464.707772020727,23464.566265060243,24491.548604427331,25055.583643122678,24500.123175182485,24076.435739436623,24470.77345731192,24849.490322580645,25178.476664116297,24866.28560939795,25468.513186029937,25495.617301038063,25733.482456140355,26033.246062992126,26631.408540471639,27794.781308411213,29187.947239263802,29763.655462184877,31058.801974448321,30980.23997741389,30289.101723179545,30236.319565217393,30732]
["Utah",18392.222972972973,18181.146044624747,18187.769516728626,19122.390158172231,19787.742574257423,20437.125766871166,20274.225895316809,19488.336165048542,19480.182618261824,19522.276683937824,19980.53714859438,20782.636188642926,21151.182156133829,21416.7098540146,21166.444542253525,21064.825021132714,21335.03629032258,21553.677888293805,21486.334801762117,21697.24518888097,21904.556401384085,22390.130904183541,22903.505249343831,23511.970044614405,24245.109034267913,25157.30797546012,25390.382352941178,26193.694541231132,26386.268774703556,26140.441912173432,26024.054891304349,26603]
["Vermont",19234.614864864867,18571.973630831646,18247.459107806691,19062.632688927944,19176.778877887788,20222.730061349692,20190.964187327827,19745.093446601939,20082.833883388339,20209.363730569949,20784.689759036148,21889.855630413858,22766.312267657995,23843.454379562045,24734.925176056338,25535.830938292478,26453.616935483871,25836.085692425404,24943.953744493396,25669.126870990734,25472.086505190313,25780.643724696361,26032.006561679787,26443.59209687699,27072.135825545171,28542.442331288345,29345.263505402163,30364.413472706161,30879.976849237719,30756.364091161759,30948.801086956522,31780]
["Virginia",21149.141891891893,21012.730223123734,20929.979553903348,21745.079086115995,22427.978547854786,23238.756134969324,23287.25895316805,23254.873786407767,23455.602860286028,23791.612435233161,24727.692771084341,26153.286814244464,26976.18401486989,28141.963503649637,28807.25,29562.929839391378,30071.661290322583,29554.828615149199,29034.013215859035,29366.342836778331,29374.276816608999,29705.226045883945,29817.443569553805,30139.723390694708,30961.945794392523,32194.122699386502,33138.003601440578,34101.82520325204,34670.776397515525,34664.567537520845,34919.807608695657,36160]
["Washington",22523.346846846849,22614.356997971605,22980.492565055763,23816.67135325132,24335.681518151814,25576.828220858897,25657.615702479343,24832.097087378639,24675.45214521452,24410.186528497408,24991.318273092373,25567.860442733396,25903.526951672862,26787.26094890511,26954.832746478874,27410.459847844464,28271.017741935484,28710.776587605204,28694.215124816452,29229.009978617247,29039.616608996541,29237.437246963567,29363.786089238845,30186.677501593371,31134.957009345795,32894.095705521475,34057.558823529413,34860.935540069695,34442.517786561264,34177.354641467486,33757.661956521741,35041]
["West Virginia",17060.563063063062,17004.831643002031,17467.983271375466,18156.31107205624,18790.250825082509,19304.305214723925,19178.814049586781,18610.317961165048,18343.457645764574,18398.664248704663,18233.781124497993,18922.725697786333,19128.758364312267,19634.569343065694,19703.134683098593,19998.1707523246,20495.650000000001,20946.654169854628,20935.723201174747,21693.20598717035,21632.644982698963,21915.968960863702,21972.639763779527,22206.886551943913,22647.991900311525,23439.8245398773,23503.650060024011,24022.770615563302,24810.85770750988,25202.767092829352,25167.845108695652,25792]
["Wisconsin",21795.826576576579,21507.012170385398,21368.873605947956,22163.381370826013,23066.996699669966,23887.737730061352,23935.139118457304,23170.052184466018,22861.264026402638,22705.192746113989,22897.486947791167,23980.664100096245,24297.174721189593,25039.591240875914,25408.380281690144,25639.622147083686,26328.699193548389,26119.363427697019,25737.278267254042,26501.202423378472,26578.033910034603,27293.628205128211,27535.521653543306,28019.564690885913,28851.679750778814,30334.095092024538,30767.115846338536,31340.725900116151,31358.893280632408,31527.084491384103,31480.595652173914,32166]
["Wyoming",22931.779279279279,23568.436105476678,23601.966542750932,23982.664323374342,25426.688118811879,27121.056748466257,27364.480716253449,26863.230582524269,26772.262926292628,26263.951295336788,24259.235943775104,24682.448508180943,25134.584572490709,24239.868613138689,23574.254401408452,23820.880811496198,25044.483870967742,26018.192807957155,25907.870778267257,26047.465431218818,26113.954325259518,26127.342780026996,26077.868110236221,26336.440407903123,27554.684112149531,28782.333742331288,30087.937575030013,31220.058072009298,32324.19254658385,32536.16120066704,33138.603804347826,34279]

{"sheet":"Vlookup(2)","index":7,"n_rows":1979,"n_cols":16,"rows_kept":1979,"cut":false,"hidden":false,"merged":[]}
[null,"Major.Category","Majors","Major","All.Applicants..Mean.Highest.LSAT","Applicants","Year","total sum","total sum with v lookup comand",null,null,null,"Help Column","Major","Year","x"]
[1,"Business & Management","ACCOUNTING","Accounting",150.9793708,1959,2002,1959,{"$f":"VLOOKUP(D2&G2,$M$2:$P$436,4)","v":1959},null,null,null,{"$f":"CONCATENATE(N2,O2)","v":"Accounting2002"},"Accounting",2002,1959]
[2,"Business & Management","ACCOUNTING","Accounting",151.02444550000001,2233,2003,2233,2233,null,null,null,{"$f":"CONCATENATE(N3,O3)","v":"Accounting2003"},"Accounting",2003,2233]
[3,"Business & Management","ACCOUNTING","Accounting",151.6789727,2522,2004,2522,2522,null,null,null,"Accounting2004","Accounting",2004,2522]
[4,"Business & Management","ACCOUNTING","Accounting",152.11445040000001,2452,2005,2452,2452,null,null,null,"Accounting2005","Accounting",2005,2452]
[5,"Business & Management","ACCOUNTING","Accounting",152.54448070000001,2170,2006,2170,2170,null,null,null,"Accounting2006","Accounting",2006,2170]
[6,"Business & Management","ACCOUNTING","Accounting",152.5959488,1890,2007,1890,1890,null,null,null,"Accounting2007","Accounting",2007,1890]
[7,"Business & Management","ACCOUNTING","Accounting",152.61017960000001,1686,2008,1686,1686,null,null,null,"Accounting2008","Accounting",2008,1686]
[8,"Business & Management","ACCOUNTING","Accounting",152.5633717,1664,2009,1664,1664,null,null,null,"Accounting2009","Accounting",2009,1664]
[9,"Business & Management","ACCOUNTING","Accounting",153.26328219999999,1706,2010,1706,1706,null,null,null,"Accounting2010","Accounting",2010,1706]
[10,"Business & Management","ACCOUNTING","Accounting",153.7081733,1835,2011,1835,1835,null,null,null,"Accounting2011","Accounting",2011,1835]
[11,"Business & Management","ACCOUNTING","Accounting",153.5151515,1666,2012,1666,1666,null,null,null,"Accounting2012","Accounting",2012,1666]
[12,"Business & Management","ACCOUNTING","Accounting",152.71847510000001,1384,2013,1384,1384,null,null,null,"Accounting2013","Accounting",2013,1384]
[13,"Business & Management","ACCOUNTING","Accounting",152.12285220000001,1204,2014,1204,1204,null,null,null,"Accounting2014","Accounting",2014,1204]
[14,"Business & Management","ACCOUNTING","Accounting",152.34862390000001,1019,2015,1019,1019,null,null,null,"Accounting2015","Accounting",2015,1019]
[15,"Business & Management","ACCOUNTING","Accounting",151.50867679999999,962,2016,962,962,null,null,null,"Accounting2016","Accounting",2016,962]
[31,"Social Sciences & Helping Professions","AFRICAN AMERICAN STUDIES","Anthropology/Geography/African American studies/Geology",147.8067633,207,2002,1388,{"$f":"VLOOKUP(D17&G17,$M$2:$P$436,4)","v":1388},null,null,null,"Anthropology/Geography/African American studies/Geology2002","Anthropology/Geography/African American studies/Geology",2002,1388]
[72,"Social Sciences & Helping Professions","AMERICAN CIVILIZATION","Anthropology/Geography/African American studies/Geology",159.1442308,106,2002,1388,1388,null,null,null,"Anthropology/Geography/African American studies/Geology2003","Anthropology/Geography/African American studies/Geology",2003,1455]
[102,"Social Sciences & Helping Professions","ANTHROPOLOGY","Anthropology/Geography/African American studies/Geology",155.63543189999999,685,2002,1388,1388,null,null,null,"Anthropology/Geography/African American studies/Geology2004","Anthropology/Geography/African American studies/Geology",2004,1569]
[147,"Social Sciences & Helping Professions","ARCHEOLOGY","Anthropology/Geography/African American studies/Geology",157.73684209999999,19,2002,1388,1388,null,null,null,"Anthropology/Geography/African American studies/Geology2005","Anthropology/Geography/African American studies/Geology",2005,1599]
[839,"Natural Sciences","GEOGRAPHY","Anthropology/Geography/African American studies/Geology",151.8451613,156,2002,1388,1388,null,null,null,"Anthropology/Geography/African American studies/Geology2006","Anthropology/Geography/African American studies/Geology",2006,1522]
[854,"Natural Sciences","GEOLOGY/ EARTH SCIENCES","Anthropology/Geography/African American studies/Geology",154.12949639999999,141,2002,1388,1388,null,null,null,"Anthropology/Geography/African American studies/Geology2007","Anthropology/Geography/African American studies/Geology",2007,1453]
[1006,"Social Sciences & Helping Professions","INDIAN STUDIES","Anthropology/Geography/African American studies/Geology",146.38888890000001,18,2002,1388,1388,null,null,null,"Anthropology/Geography/African American studies/Geology2008","Anthropology/Geography/African American studies/Geology",2008,1347]
[1081,"Social Sciences & Helping Professions","INTER AMERICAN RELATIONS","Anthropology/Geography/African American studies/Geology",151.91304349999999,23,2002,1388,1388,null,null,null,"Anthropology/Geography/African American studies/Geology2009","Anthropology/Geography/African American studies/Geology",2009,1365]
[1311,"Social Sciences & Helping Professions","MEXICAN AMERICAN STUDIES","Anthropology/Geography/African American studies/Geology",147.56,25,2002,1388,1388,null,null,null,"Anthropology/Geography/African American studies/Geology2010","Anthropology/Geography/African American studies/Geology",2010,1399]
[1396,"Natural Sciences","OCEANOGRAPHY","Anthropology/Geography/African American studies/Geology",152,8,2002,1388,1388,null,null,null,"Anthropology/Geography/African American studies/Geology2011","Anthropology/Geography/African American studies/Geology",2011,1466]
[32,"Social Sciences & Helping Professions","AFRICAN AMERICAN STUDIES","Anthropology/Geography/African American studies/Geology",148.4811321,213,2003,1455,1455,null,null,null,"Anthropology/Geography/African American studies/Geology2012","Anthropology/Geography/African American studies/Geology",2012,1280]
[73,"Social Sciences & Helping Professions","AMERICAN CIVILIZATION","Anthropology/Geography/African American studies/Geology",157.2222222,99,2003,1455,1455,null,null,null,"Anthropology/Geography/African American studies/Geology2013","Anthropology/Geography/African American studies/Geology",2013,1101]
[103,"Social Sciences & Helping Professions","ANTHROPOLOGY","Anthropology/Geography/African American studies/Geology",155.7706044,731,2003,1455,1455,null,null,null,"Anthropology/Geography/African American studies/Geology2014","Anthropology/Geography/African American studies/Geology",2014,973]
[148,"Social Sciences & Helping Professions","ARCHEOLOGY","Anthropology/Geography/African American studies/Geology",155.3846154,13,2003,1455,1455,null,null,null,"Anthropology/Geography/African American studies/Geology2015","Anthropology/Geography/African American studies/Geology",2015,907]
[840,"Natural Sciences","GEOGRAPHY","Anthropology/Geography/African American studies/Geology",154.2222222,171,2003,1455,1455,null,null,null,"Anthropology/Geography/African American studies/Geology2016","Anthropology/Geography/African American studies/Geology",2016,819]
[855,"Natural Sciences","GEOLOGY/ EARTH SCIENCES","Anthropology/Geography/African American studies/Geology",156.07594940000001,158,2003,1455,1455,null,null,null,"Arts (Music/Art history/Drama/Film/Art design/Perf. arts/Fine arts)2002","Arts (Music/Art history/Drama/Film/Art design/Perf. arts/Fine arts)",2002,1496]
[1007,"Social Sciences & Helping Professions","INDIAN STUDIES","Anthropology/Geography/African American studies/Geology",150.1333333,17,2003,1455,1455,null,null,null,"Arts (Music/Art history/Drama/Film/Art design/Perf. arts/Fine arts)2003","Arts (Music/Art history/Drama/Film/Art design/Perf. arts/Fine arts)",2003,1917]
[1082,"Social Sciences & Helping Professions","INTER AMERICAN RELATIONS","Anthropology/Geography/African American studies/Geology",154.94736839999999,19,2003,1455,1455,null,null,null,"Arts (Music/Art history/Drama/Film/Art design/Perf. arts/Fine arts)2004","Arts (Music/Art history/Drama/Film/Art design/Perf. arts/Fine arts)",2004,2160]
[1312,"Social Sciences & Helping Professions","MEXICAN AMERICAN STUDIES","Anthropology/Geography/African American studies/Geology",147.31818179999999,23,2003,1455,1455,null,null,null,"Arts (Music/Art history/Drama/Film/Art design/Perf. arts/Fine arts)2005","Arts (Music/Art history/Drama/Film/Art design/Perf. arts/Fine arts)",2005,2468]
[1397,"Natural Sciences","OCEANOGRAPHY","Anthropology/Geography/African American studies/Geology",152.9090909,11,2003,1455,1455,null,null,null,"Arts (Music/Art history/Drama/Film/Art design/Perf. arts/Fine arts)2006","Arts (Music/Art history/Drama/Film/Art design/Perf. arts/Fine arts)",2006,2257]
[33,"Social Sciences & Helping Professions","AFRICAN AMERICAN STUDIES","Anthropology/Geography/African American studies/Geology",149.2488889,225,2004,1569,1569,null,null,null,"Arts (Music/Art history/Drama/Film/Art design/Perf. arts/Fine arts)2007","Arts (Music/Art history/Drama/Film/Art design/Perf. arts/Fine arts)",2007,2196]
[74,"Social Sciences & Helping Professions","AMERICAN CIVILIZATION","Anthropology/Geography/African American studies/Geology",158.3482143,112,2004,1569,1569,null,null,null,"Arts (Music/Art history/Drama/Film/Art design/Perf. arts/Fine arts)2008","Arts (Music/Art history/Drama/Film/Art design/Perf. arts/Fine arts)",2008,2072]
[104,"Social Sciences & Helping Professions","ANTHROPOLOGY","Anthropology/Geography/African American studies/Geology",156.3775253,794,2004,1569,1569,null,null,null,"Arts (Music/Art history/Drama/Film/Art design/Perf. arts/Fine arts)2009","Arts (Music/Art history/Drama/Film/Art design/Perf. arts/Fine arts)",2009,2070]
[149,"Social Sciences & Helping Professions","ARCHEOLOGY","Anthropology/Geography/African American studies/Geology",154.47826090000001,23,2004,1569,1569,null,null,null,"Arts (Music/Art history/Drama/Film/Art design/Perf. arts/Fine arts)2010","Arts (Music/Art history/Drama/Film/Art design/Perf. arts/Fine arts)",2010,2276]
[841,"Natural Sciences","GEOGRAPHY","Anthropology/Geography/African American studies/Geology",154.2392638,163,2004,1569,1569,null,null,null,"Arts (Music/Art history/Drama/Film/Art design/Perf. arts/Fine arts)2011","Arts (Music/Art history/Drama/Film/Art design/Perf. arts/Fine arts)",2011,2427]
[856,"Natural Sciences","GEOLOGY/ EARTH SCIENCES","Anthropology/Geography/African American studies/Geology",156.82658960000001,174,2004,1569,1569,null,null,null,"Arts (Music/Art history/Drama/Film/Art design/Perf. arts/Fine arts)2012","Arts (Music/Art history/Drama/Film/Art design/Perf. arts/Fine arts)",2012,2079]
[1008,"Social Sciences & Helping Professions","INDIAN STUDIES","Anthropology/Geography/African American studies/Geology",148.7857143,14,2004,1569,1569,null,null,null,"Arts (Music/Art history/Drama/Film/Art design/Perf. arts/Fine arts)2013","Arts (Music/Art history/Drama/Film/Art design/Perf. arts/Fine arts)",2013,1666]
[1083,"Social Sciences & Helping Professions","INTER AMERICAN RELATIONS","Anthropology/Geography/African American studies/Geology",154.68,25,2004,1569,1569,null,null,null,"Arts (Music/Art history/Drama/Film/Art design/Perf. arts/Fine arts)2014","Arts (Music/Art history/Drama/Film/Art design/Perf. arts/Fine arts)",2014,1353]
[1313,"Social Sciences & Helping Professions","MEXICAN AMERICAN STUDIES","Anthropology/Geography/African American studies/Geology",148.45454549999999,34,2004,1569,1569,null,null,null,"Arts (Music/Art history/Drama/Film/Art design/Perf. arts/Fine arts)2015","Arts (Music/Art history/Drama/Film/Art design/Perf. arts/Fine arts)",2015,1257]
[1398,"Natural Sciences","OCEANOGRAPHY","Anthropology/Geography/African American studies/Geology",153,5,2004,1569,1569,null,null,null,"Arts (Music/Art history/Drama/Film/Art design/Perf. arts/Fine arts)2016","Arts (Music/Art history/Drama/Film/Art design/Perf. arts/Fine arts)",2016,1263]
[34,"Social Sciences & Helping Professions","AFRICAN AMERICAN STUDIES","Anthropology/Geography/African American studies/Geology",149.11979170000001,193,2005,1599,1599,null,null,null,"Biology/Environ. sciences/Other natural sciences2002","Biology/Environ. sciences/Other natural sciences",2002,3585]
[75,"Social Sciences & Helping Professions","AMERICAN CIVILIZATION","Anthropology/Geography/African American studies/Geology",158.26956519999999,115,2005,1599,1599,null,null,null,"Biology/Environ. sciences/Other natural sciences2003","Biology/Environ. sciences/Other natural sciences",2003,3915]
[105,"Social Sciences & Helping Professions","ANTHROPOLOGY","Anthropology/Geography/African American studies/Geology",156.16851170000001,817,2005,1599,1599,null,null,null,"Biology/Environ. sciences/Other natural sciences2004","Biology/Environ. sciences/Other natural sciences",2004,3877]
[150,"Social Sciences & Helping Professions","ARCHEOLOGY","Anthropology/Geography/African American studies/Geology",154.91666670000001,24,2005,1599,1599,null,null,null,"Biology/Environ. sciences/Other natural sciences2005","Biology/Environ. sciences/Other natural sciences",2005,3725]
[222,"Social Sciences & Helping Professions","ASIAN AMERICAN STUDIES","Anthropology/Geography/African American studies/Geology",154.3064516,62,2005,1599,1599,null,null,null,"Biology/Environ. sciences/Other natural sciences2006","Biology/Environ. sciences/Other natural sciences",2006,3385]
[842,"Natural Sciences","GEOGRAPHY","Anthropology/Geography/African American studies/Geology",153.85714290000001,175,2005,1599,1599,null,null,null,"Biology/Environ. sciences/Other natural sciences2007","Biology/Environ. sciences/Other natural sciences",2007,2943]
[857,"Natural Sciences","GEOLOGY/ EARTH SCIENCES","Anthropology/Geography/African American studies/Geology",156.2464789,143,2005,1599,1599,null,null,null,"Biology/Environ. sciences/Other natural sciences2008","Biology/Environ. sciences/Other natural sciences",2008,2729]
[1009,"Social Sciences & Helping Professions","INDIAN STUDIES","Anthropology/Geography/African American studies/Geology",147.69999999999999,10,2005,1599,1599,null,null,null,"Biology/Environ. sciences/Other natural sciences2009","Biology/Environ. sciences/Other natural sciences",2009,2630]
[1084,"Social Sciences & Helping Professions","INTER AMERICAN RELATIONS","Anthropology/Geography/African American studies/Geology",153.07407409999999,27,2005,1599,1599,null,null,null,"Biology/Environ. sciences/Other natural sciences2010","Biology/Environ. sciences/Other natural sciences",2010,2779]
[1314,"Social Sciences & Helping Professions","MEXICAN AMERICAN STUDIES","Anthropology/Geography/African American studies/Geology",150.21212120000001,33,2005,1599,1599,null,null,null,"Biology/Environ. sciences/Other natural sciences2011","Biology/Environ. sciences/Other natural sciences",2011,2724]
[35,"Social Sciences & Helping Professions","AFRICAN AMERICAN STUDIES","Anthropology/Geography/African American studies/Geology",149.4428571,212,2006,1522,1522,null,null,null,"Biology/Environ. sciences/Other natural sciences2012","Biology/Environ. sciences/Other natural sciences",2012,2498]
[76,"Social Sciences & Helping Professions","AMERICAN CIVILIZATION","Anthropology/Geography/African American studies/Geology",158.1860465,86,2006,1522,1522,null,null,null,"Biology/Environ. sciences/Other natural sciences2013","Biology/Environ. sciences/Other natural sciences",2013,2180]
[106,"Social Sciences & Helping Professions","ANTHROPOLOGY","Anthropology/Geography/African American studies/Geology",156.0844156,776,2006,1522,1522,null,null,null,"Biology/Environ. sciences/Other natural sciences2014","Biology/Environ. sciences/Other natural sciences",2014,1910]
[151,"Social Sciences & Helping Professions","ARCHEOLOGY","Anthropology/Geography/African American studies/Geology",157.7777778,27,2006,1522,1522,null,null,null,"Biology/Environ. sciences/Other natural sciences2015","Biology/Environ. sciences/Other natural sciences",2015,1787]
[223,"Social Sciences & Helping Professions","ASIAN AMERICAN STUDIES","Anthropology/Geography/African American studies/Geology",156.17543860000001,58,2006,1522,1522,null,null,null,"Biology/Environ. sciences/Other natural sciences2016","Biology/Environ. sciences/Other natural sciences",2016,1831]
[843,"Natural Sciences","GEOGRAPHY","Anthropology/Geography/African American studies/Geology",154.66225170000001,151,2006,1522,{"$f":"VLOOKUP(D62&G62,$M$2:$P$436,4)","v":1522},null,null,null,"Business administration/Business education2002","Business administration/Business education",2002,2424]
[858,"Natural Sciences","GEOLOGY/ EARTH SCIENCES","Anthropology/Geography/African American studies/Geology",157.1860465,130,2006,1522,1522,null,null,null,"Business administration/Business education2003","Business administration/Business education",2003,2998]
[1010,"Social Sciences & Helping Professions","INDIAN STUDIES","Anthropology/Geography/African American studies/Geology",146.18181820000001,11,2006,1522,1522,null,null,null,"Business administration/Business education2004","Business administration/Business education",2004,3316]
[1085,"Social Sciences & Helping Professions","INTER AMERICAN RELATIONS","Anthropology/Geography/African American studies/Geology",153.81481479999999,27,2006,1522,1522,null,null,null,"Business administration/Business education2005","Business administration/Business education",2005,3392]
[1315,"Social Sciences & Helping Professions","MEXICAN AMERICAN STUDIES","Anthropology/Geography/African American studies/Geology",149.86363639999999,44,2006,1522,{"$f":"VLOOKUP(D66&G66,$M$2:$P$436,4)","v":1522},null,null,null,"Business administration/Business education2006","Business administration/Business education",2006,3174]
[36,"Social Sciences & Helping Professions","AFRICAN AMERICAN STUDIES","Anthropology/Geography/African American studies/Geology",148.79081629999999,197,2007,1453,1453,null,null,null,{"$f":"CONCATENATE(N67,O67)","v":"Business administration/Business education2007"},"Business administration/Business education",2007,2816]
[77,"Social Sciences & Helping Professions","AMERICAN CIVILIZATION","Anthropology/Geography/African American studies/Geology",160.55813950000001,87,2007,1453,1453,null,null,null,"Business administration/Business education2008","Business administration/Business education",2008,2707]
[107,"Social Sciences & Helping Professions","ANTHROPOLOGY","Anthropology/Geography/African American studies/Geology",156.71700680000001,738,2007,1453,1453,null,null,null,"Business administration/Business education2009","Business administration/Business education",2009,2612]
[152,"Social Sciences & Helping Professions","ARCHEOLOGY","Anthropology/Geography/African American studies/Geology",159.1333333,15,2007,1453,1453,null,null,null,"Business administration/Business education2010","Business administration/Business education",2010,2794]
[224,"Social Sciences & Helping Professions","ASIAN AMERICAN STUDIES","Anthropology/Geography/African American studies/Geology",154.0727273,55,2007,1453,1453,null,null,null,"Business administration/Business education2011","Business administration/Business education",2011,3046]
[844,"Natural Sciences","GEOGRAPHY","Anthropology/Geography/African American studies/Geology",153.13725489999999,155,2007,1453,1453,null,null,null,"Business administration/Business education2012","Business administration/Business education",2012,2764]
[859,"Natural Sciences","GEOLOGY/ EARTH SCIENCES","Anthropology/Geography/African American studies/Geology",156.0272727,111,2007,1453,1453,null,null,null,"Business administration/Business education2013","Business administration/Business education",2013,2275]
[1011,"Social Sciences & Helping Professions","INDIAN STUDIES","Anthropology/Geography/African American studies/Geology",150.05263160000001,19,2007,1453,1453,null,null,null,"Business administration/Business education2014","Business administration/Business education",2014,2027]
[1086,"Social Sciences & Helping Professions","INTER AMERICAN RELATIONS","Anthropology/Geography/African American studies/Geology",156.1935484,31,2007,1453,1453,null,null,null,"Business administration/Business education2015","Business administration/Business education",2015,1760]
[1316,"Social Sciences & Helping Professions","MEXICAN AMERICAN STUDIES","Anthropology/Geography/African American studies/Geology",150.30769230000001,39,2007,1453,{"$f":"VLOOKUP(D76&G76,$M$2:$P$436,4)","v":1453},null,null,null,"Business administration/Business education2016","Business administration/Business education",2016,1707]
[1399,"Natural Sciences","OCEANOGRAPHY","Anthropology/Geography/African American studies/Geology",155.33333329999999,6,2007,1453,1453,null,null,null,"Business mgmt./Intl. bus./Public affairs/Hotel & rest. mgmt.2002","Business mgmt./Intl. bus./Public affairs/Hotel & rest. mgmt.",2002,3934]
[37,"Social Sciences & Helping Professions","AFRICAN AMERICAN STUDIES","Anthropology/Geography/African American studies/Geology",149.47395829999999,192,2008,1347,1347,null,null,null,"Business mgmt./Intl. bus./Public affairs/Hotel & rest. mgmt.2003","Business mgmt./Intl. bus./Public affairs/Hotel & rest. mgmt.",2003,5018]
[78,"Social Sciences & Helping Professions","AMERICAN CIVILIZATION","Anthropology/Geography/African American studies/Geology",157.5180723,83,2008,1347,1347,null,null,null,"Business mgmt./Intl. bus./Public affairs/Hotel & rest. mgmt.2004","Business mgmt./Intl. bus./Public affairs/Hotel & rest. mgmt.",2004,5539]
[108,"Social Sciences & Helping Professions","ANTHROPOLOGY","Anthropology/Geography/African American studies/Geology",156.83720930000001,647,2008,1347,1347,null,null,null,"Business mgmt./Intl. bus./Public affairs/Hotel & rest. mgmt.2005","Business mgmt./Intl. bus./Public affairs/Hotel & rest. mgmt.",2005,5855]
[153,"Social Sciences & Helping Professions","ARCHEOLOGY","Anthropology/Geography/African American studies/Geology",158.68181820000001,22,2008,1347,1347,null,null,null,"Business mgmt./Intl. bus./Public affairs/Hotel & rest. mgmt.2006","Business mgmt./Intl. bus./Public affairs/Hotel & rest. mgmt.",2006,5482]
[225,"Social Sciences & Helping Professions","ASIAN AMERICAN STUDIES","Anthropology/Geography/African American studies/Geology",156.5223881,67,2008,1347,1347,null,null,null,"Business mgmt./Intl. bus./Public affairs/Hotel & rest. mgmt.2007","Business mgmt./Intl. bus./Public affairs/Hotel & rest. mgmt.",2007,4736]
[845,"Natural Sciences","GEOGRAPHY","Anthropology/Geography/African American studies/Geology",153.72471909999999,178,2008,1347,1347,null,null,null,"Business mgmt./Intl. bus./Public affairs/Hotel & rest. mgmt.2008","Business mgmt./Intl. bus./Public affairs/Hotel & rest. mgmt.",2008,4668]
[860,"Natural Sciences","GEOLOGY/ EARTH SCIENCES","Anthropology/Geography/African American studies/Geology",156.86301370000001,73,2008,1347,1347,null,null,null,"Business mgmt./Intl. bus./Public affairs/Hotel & rest. mgmt.2009","Business mgmt./Intl. bus./Public affairs/Hotel & rest. mgmt.",2009,4605]
[1012,"Social Sciences & Helping Professions","INDIAN STUDIES","Anthropology/Geography/African American studies/Geology",147.25,12,2008,1347,1347,null,null,null,"Business mgmt./Intl. bus./Public affairs/Hotel & rest. mgmt.2010","Business mgmt./Intl. bus./Public affairs/Hotel & rest. mgmt.",2010,4828]
[1087,"Social Sciences & Helping Professions","INTER AMERICAN RELATIONS","Anthropology/Geography/African American studies/Geology",156.84,25,2008,1347,1347,null,null,null,"Business mgmt./Intl. bus./Public affairs/Hotel & rest. mgmt.2011","Business mgmt./Intl. bus./Public affairs/Hotel & rest. mgmt.",2011,5432]
[1317,"Social Sciences & Helping Professions","MEXICAN AMERICAN STUDIES","Anthropology/Geography/African American studies/Geology",150.02325579999999,43,2008,1347,1347,null,null,null,"Business mgmt./Intl. bus./Public affairs/Hotel & rest. mgmt.2012","Business mgmt./Intl. bus./Public affairs/Hotel & rest. mgmt.",2012,4755]
[1400,"Natural Sciences","OCEANOGRAPHY","Anthropology/Geography/African American studies/Geology",158.4,5,2008,1347,1347,null,null,null,"Business mgmt./Intl. bus./Public affairs/Hotel & rest. mgmt.2013","Business mgmt./Intl. bus./Public affairs/Hotel & rest. mgmt.",2013,4066]
[38,"Social Sciences & Helping Professions","AFRICAN AMERICAN STUDIES","Anthropology/Geography/African American studies/Geology",149.39644970000001,169,2009,1365,1365,null,null,null,"Business mgmt./Intl. bus./Public affairs/Hotel & rest. mgmt.2014","Business mgmt./Intl. bus./Public affairs/Hotel & rest. mgmt.",2014,3372]
[79,"Social Sciences & Helping Professions","AMERICAN CIVILIZATION","Anthropology/Geography/African American studies/Geology",160.04,101,2009,1365,1365,null,null,null,"Business mgmt./Intl. bus./Public affairs/Hotel & rest. mgmt.2015","Business mgmt./Intl. bus./Public affairs/Hotel & rest. mgmt.",2015,3106]
[109,"Social Sciences & Helping Professions","ANTHROPOLOGY","Anthropology/Geography/African American studies/Geology",156.5510204,687,2009,1365,1365,null,null,null,"Business mgmt./Intl. bus./Public affairs/Hotel & rest. mgmt.2016","Business mgmt./Intl. bus./Public affairs/Hotel & rest. mgmt.",2016,2864]
[154,"Social Sciences & Helping Professions","ARCHEOLOGY","Anthropology/Geography/African American studies/Geology",159.7857143,14,2009,1365,1365,null,null,null,"Chemistry/Biochemistry2002","Chemistry/Biochemistry",2002,897]
[226,"Social Sciences & Helping Professions","ASIAN AMERICAN STUDIES","Anthropology/Geography/African American studies/Geology",155.25454550000001,55,2009,1365,1365,null,null,null,"Chemistry/Biochemistry2003","Chemistry/Biochemistry",2003,989]
[846,"Natural Sciences","GEOGRAPHY","Anthropology/Geography/African American studies/Geology",155.41610739999999,149,2009,1365,1365,null,null,null,"Chemistry/Biochemistry2004","Chemistry/Biochemistry",2004,987]
[861,"Natural Sciences","GEOLOGY/ EARTH SCIENCES","Anthropology/Geography/African American studies/Geology",156.44047620000001,86,2009,1365,1365,null,null,null,"Chemistry/Biochemistry2005","Chemistry/Biochemistry",2005,967]
[1013,"Social Sciences & Helping Professions","INDIAN STUDIES","Anthropology/Geography/African American studies/Geology",150.2307692,13,2009,1365,1365,null,null,null,"Chemistry/Biochemistry2006","Chemistry/Biochemistry",2006,895]
[1088,"Social Sciences & Helping Professions","INTER AMERICAN RELATIONS","Anthropology/Geography/African American studies/Geology",158.625,25,2009,1365,1365,null,null,null,"Chemistry/Biochemistry2007","Chemistry/Biochemistry",2007,853]
[1318,"Social Sciences & Helping Professions","MEXICAN AMERICAN STUDIES","Anthropology/Geography/African American studies/Geology",148.8852459,61,2009,1365,1365,null,null,null,"Chemistry/Biochemistry2008","Chemistry/Biochemistry",2008,705]
[1401,"Natural Sciences","OCEANOGRAPHY","Anthropology/Geography/African American studies/Geology",156.4,5,2009,1365,1365,null,null,null,"Chemistry/Biochemistry2009","Chemistry/Biochemistry",2009,762]
[39,"Social Sciences & Helping Professions","AFRICAN AMERICAN STUDIES","Anthropology/Geography/African American studies/Geology",149.11428570000001,176,2010,1399,1399,null,null,null,"Chemistry/Biochemistry2010","Chemistry/Biochemistry",2010,785]
[80,"Social Sciences & Helping Professions","AMERICAN CIVILIZATION","Anthropology/Geography/African American studies/Geology",159.43181820000001,88,2010,1399,1399,null,null,null,"Chemistry/Biochemistry2011","Chemistry/Biochemistry",2011,672]
[110,"Social Sciences & Helping Professions","ANTHROPOLOGY","Anthropology/Geography/African American studies/Geology",156.49075389999999,703,2010,1399,1399,null,null,null,"Chemistry/Biochemistry2012","Chemistry/Biochemistry",2012,621]
[155,"Social Sciences & Helping Professions","ARCHEOLOGY","Anthropology/Geography/African American studies/Geology",156.92307690000001,13,2010,1399,1399,null,null,null,"Chemistry/Biochemistry2013","Chemistry/Biochemistry",2013,548]
[227,"Social Sciences & Helping Professions","ASIAN AMERICAN STUDIES","Anthropology/Geography/African American studies/Geology",155.25806449999999,62,2010,1399,1399,null,null,null,"Chemistry/Biochemistry2014","Chemistry/Biochemistry",2014,452]
[847,"Natural Sciences","GEOGRAPHY","Anthropology/Geography/African American studies/Geology",155.69696970000001,165,2010,1399,1399,null,null,null,"Chemistry/Biochemistry2015","Chemistry/Biochemistry",2015,429]
[862,"Natural Sciences","GEOLOGY/ EARTH SCIENCES","Anthropology/Geography/African American studies/Geology",156.02061860000001,97,2010,1399,1399,null,null,null,"Chemistry/Biochemistry2016","Chemistry/Biochemistry",2016,452]
[1014,"Social Sciences & Helping Professions","INDIAN STUDIES","Anthropology/Geography/African American studies/Geology",149.2222222,19,2010,1399,1399,null,null,null,"Communications/Journalism2002","Communications/Journalism",2002,3665]
[1089,"Social Sciences & Helping Professions","INTER AMERICAN RELATIONS","Anthropology/Geography/African American studies/Geology",159,26,2010,1399,1399,null,null,null,"Communications/Journalism2003","Communications/Journalism",2003,4566]
[1319,"Social Sciences & Helping Professions","MEXICAN AMERICAN STUDIES","Anthropology/Geography/African American studies/Geology",148.22,50,2010,1399,1399,null,null,null,"Communications/Journalism2004","Communications/Journalism",2004,5069]
[40,"Social Sciences & Helping Professions","AFRICAN AMERICAN STUDIES","Anthropology/Geography/African American studies/Geology",150.11111109999999,181,2011,1466,1466,null,null,null,"Communications/Journalism2005","Communications/Journalism",2005,5092]
[81,"Social Sciences & Helping Professions","AMERICAN CIVILIZATION","Anthropology/Geography/African American studies/Geology",159.88888890000001,90,2011,1466,1466,null,null,null,"Communications/Journalism2006","Communications/Journalism",2006,4796]
[111,"Social Sciences & Helping Professions","ANTHROPOLOGY","Anthropology/Geography/African American studies/Geology",156.85488129999999,759,2011,1466,1466,null,null,null,"Communications/Journalism2007","Communications/Journalism",2007,4540]
[156,"Social Sciences & Helping Professions","ARCHEOLOGY","Anthropology/Geography/African American studies/Geology",160.31578949999999,19,2011,1466,1466,null,null,null,"Communications/Journalism2008","Communications/Journalism",2008,4291]
[228,"Social Sciences & Helping Professions","ASIAN AMERICAN STUDIES","Anthropology/Geography/African American studies/Geology",156.3278689,61,2011,1466,1466,null,null,null,"Communications/Journalism2009","Communications/Journalism",2009,4233]
[848,"Natural Sciences","GEOGRAPHY","Anthropology/Geography/African American studies/Geology",154.9360465,172,2011,1466,1466,null,null,null,"Communications/Journalism2010","Communications/Journalism",2010,4569]
[863,"Natural Sciences","GEOLOGY/ EARTH SCIENCES","Anthropology/Geography/African American studies/Geology",155.86419749999999,81,2011,1466,1466,null,null,null,"Communications/Journalism2011","Communications/Journalism",2011,4907]
[1015,"Social Sciences & Helping Professions","INDIAN STUDIES","Anthropology/Geography/African American studies/Geology",149.7333333,15,2011,1466,1466,null,null,null,"Communications/Journalism2012","Communications/Journalism",2012,4121]
[1090,"Social Sciences & Helping Professions","INTER AMERICAN RELATIONS","Anthropology/Geography/African American studies/Geology",159.32352940000001,35,2011,1466,1466,null,null,null,"Communications/Journalism2013","Communications/Journalism",2013,3440]
[1320,"Social Sciences & Helping Professions","MEXICAN AMERICAN STUDIES","Anthropology/Geography/African American studies/Geology",150.16981129999999,53,2011,1466,1466,null,null,null,"Communications/Journalism2014","Communications/Journalism",2014,2896]
[41,"Social Sciences & Helping Professions","AFRICAN AMERICAN STUDIES","Anthropology/Geography/African American studies/Geology",150.3251534,166,2012,1280,1280,null,null,null,"Communications/Journalism2015","Communications/Journalism",2015,2557]
[82,"Social Sciences & Helping Professions","AMERICAN CIVILIZATION","Anthropology/Geography/African American studies/Geology",160.4032258,62,2012,1280,1280,null,null,null,"Communications/Journalism2016","Communications/Journalism",2016,2508]
[112,"Social Sciences & Helping Professions","ANTHROPOLOGY","Anthropology/Geography/African American studies/Geology",156.68267829999999,689,2012,1280,1280,null,null,null,"Computer science/Comp. info. systems/Mgmt. info. systems2002","Computer science/Comp. info. systems/Mgmt. info. systems",2002,578]
[157,"Social Sciences & Helping Professions","ARCHEOLOGY","Anthropology/Geography/African American studies/Geology",163.54545450000001,11,2012,1280,1280,null,null,null,"Computer science/Comp. info. systems/Mgmt. info. systems2003","Computer science/Comp. info. systems/Mgmt. info. systems",2003,1256]
[229,"Social Sciences & Helping Professions","ASIAN AMERICAN STUDIES","Anthropology/Geography/African American studies/Geology",156.36363639999999,44,2012,1280,1280,null,null,null,"Computer science/Comp. info. systems/Mgmt. info. systems2004","Computer science/Comp. info. systems/Mgmt. info. systems",2004,1886]
[849,"Natural Sciences","GEOGRAPHY","Anthropology/Geography/African American studies/Geology",154.8742857,175,2012,1280,1280,null,null,null,"Computer science/Comp. info. systems/Mgmt. info. systems2005","Computer science/Comp. info. systems/Mgmt. info. systems",2005,2153]
[864,"Natural Sciences","GEOLOGY/ EARTH SCIENCES","Anthropology/Geography/African American studies/Geology",156.609375,64,2012,1280,1280,null,null,null,"Computer science/Comp. info. systems/Mgmt. info. systems2006","Computer science/Comp. info. systems/Mgmt. info. systems",2006,1900]
[1016,"Social Sciences & Helping Professions","INDIAN STUDIES","Anthropology/Geography/African American studies/Geology",149.14285709999999,14,2012,1280,1280,null,null,null,"Computer science/Comp. info. systems/Mgmt. info. systems2007","Computer science/Comp. info. systems/Mgmt. info. systems",2007,1423]
[1091,"Social Sciences & Helping Professions","INTER AMERICAN RELATIONS","Anthropology/Geography/African American studies/Geology",158.625,16,2012,1280,1280,null,null,null,"Computer science/Comp. info. systems/Mgmt. info. systems2008","Computer science/Comp. info. systems/Mgmt. info. systems",2008,1131]
[1321,"Social Sciences & Helping Professions","MEXICAN AMERICAN STUDIES","Anthropology/Geography/African American studies/Geology",150.97435899999999,39,2012,1280,1280,null,null,null,"Computer science/Comp. info. systems/Mgmt. info. systems2009","Computer science/Comp. info. systems/Mgmt. info. systems",2009,900]
[42,"Social Sciences & Helping Professions","AFRICAN AMERICAN STUDIES","Anthropology/Geography/African American studies/Geology",151.14393939999999,132,2013,1101,{"$f":"VLOOKUP(D130&G130,$M$2:$P$436,4)","v":1101},null,null,null,"Computer science/Comp. info. systems/Mgmt. info. systems2010","Computer science/Comp. info. systems/Mgmt. info. systems",2010,838]
[83,"Social Sciences & Helping Professions","AMERICAN CIVILIZATION","Anthropology/Geography/African American studies/Geology",158.5,66,2013,1101,1101,null,null,null,{"$f":"CONCATENATE(N131,O131)","v":"Computer science/Comp. info. systems/Mgmt. info. systems2011"},"Computer science/Comp. info. systems/Mgmt. info. systems",2011,768]
[113,"Social Sciences & Helping Professions","ANTHROPOLOGY","Anthropology/Geography/African American studies/Geology",156.23769100000001,592,2013,1101,1101,null,null,null,"Computer science/Comp. info. systems/Mgmt. info. systems2012","Computer science/Comp. info. systems/Mgmt. info. systems",2012,633]
[158,"Social Sciences & Helping Professions","ARCHEOLOGY","Anthropology/Geography/African American studies/Geology",157.33333329999999,12,2013,1101,1101,null,null,null,"Computer science/Comp. info. systems/Mgmt. info. systems2013","Computer science/Comp. info. systems/Mgmt. info. systems",2013,492]
[230,"Social Sciences & Helping Professions","ASIAN AMERICAN STUDIES","Anthropology/Geography/African American studies/Geology",155.5757576,33,2013,1101,1101,null,null,null,"Computer science/Comp. info. systems/Mgmt. info. systems2014","Computer science/Comp. info. systems/Mgmt. info. systems",2014,394]
[850,"Natural Sciences","GEOGRAPHY","Anthropology/Geography/African American studies/Geology",154.74809160000001,132,2013,1101,1101,null,null,null,"Computer science/Comp. info. systems/Mgmt. info. systems2015","Computer science/Comp. info. systems/Mgmt. info. systems",2015,333]
[865,"Natural Sciences","GEOLOGY/ EARTH SCIENCES","Anthropology/Geography/African American studies/Geology",157.2857143,56,2013,1101,1101,null,null,null,"Computer science/Comp. info. systems/Mgmt. info. systems2016","Computer science/Comp. info. systems/Mgmt. info. systems",2016,341]
[1017,"Social Sciences & Helping Professions","INDIAN STUDIES","Anthropology/Geography/African American studies/Geology",145.5,16,2013,1101,1101,null,null,null,"Criminal Justice/Criminology2002","Criminal Justice/Criminology",2002,4517]
[1092,"Social Sciences & Helping Professions","INTER AMERICAN RELATIONS","Anthropology/Geography/African American studies/Geology",153.52631579999999,19,2013,1101,1101,null,null,null,"Criminal Justice/Criminology2003","Criminal Justice/Criminology",2003,4723]
[1322,"Social Sciences & Helping Professions","MEXICAN AMERICAN STUDIES","Anthropology/Geography/African American studies/Geology",147.2142857,43,2013,1101,1101,null,null,null,"Criminal Justice/Criminology2004","Criminal Justice/Criminology",2004,4888]
[43,"Social Sciences & Helping Professions","AFRICAN AMERICAN STUDIES","Anthropology/Geography/African American studies/Geology",150.51388890000001,150,2014,973,973,null,null,null,"Criminal Justice/Criminology2005","Criminal Justice/Criminology",2005,4957]
[84,"Social Sciences & Helping Professions","AMERICAN CIVILIZATION","Anthropology/Geography/African American studies/Geology",158.33962260000001,53,2014,973,973,null,null,null,"Criminal Justice/Criminology2006","Criminal Justice/Criminology",2006,4936]
[114,"Social Sciences & Helping Professions","ANTHROPOLOGY","Anthropology/Geography/African American studies/Geology",156.73684209999999,503,2014,973,973,null,null,null,"Criminal Justice/Criminology2007","Criminal Justice/Criminology",2007,4899]
[159,"Social Sciences & Helping Professions","ARCHEOLOGY","Anthropology/Geography/African American studies/Geology",161.2857143,14,2014,973,973,null,null,null,"Criminal Justice/Criminology2008","Criminal Justice/Criminology",2008,4942]
[231,"Social Sciences & Helping Professions","ASIAN AMERICAN STUDIES","Anthropology/Geography/African American studies/Geology",158.14814809999999,27,2014,973,973,null,null,null,"Criminal Justice/Criminology2009","Criminal Justice/Criminology",2009,4969]
[851,"Natural Sciences","GEOGRAPHY","Anthropology/Geography/African American studies/Geology",153.57425739999999,101,2014,973,973,null,null,null,"Criminal Justice/Criminology2010","Criminal Justice/Criminology",2010,4883]
[866,"Natural Sciences","GEOLOGY/ EARTH SCIENCES","Anthropology/Geography/African American studies/Geology",156.29411759999999,52,2014,973,973,null,null,null,"Criminal Justice/Criminology2011","Criminal Justice/Criminology",2011,4706]
[1018,"Social Sciences & Helping Professions","INDIAN STUDIES","Anthropology/Geography/African American studies/Geology",149.16666670000001,12,2014,973,973,null,null,null,"Criminal Justice/Criminology2012","Criminal Justice/Criminology",2012,4737]
[1093,"Social Sciences & Helping Professions","INTER AMERICAN RELATIONS","Anthropology/Geography/African American studies/Geology",154.125,16,2014,973,973,null,null,null,"Criminal Justice/Criminology2013","Criminal Justice/Criminology",2013,4771]
[1323,"Social Sciences & Helping Professions","MEXICAN AMERICAN STUDIES","Anthropology/Geography/African American studies/Geology",149.53846150000001,40,2014,973,973,null,null,null,"Criminal Justice/Criminology2014","Criminal Justice/Criminology",2014,4780]
[1402,"Natural Sciences","OCEANOGRAPHY","Anthropology/Geography/African American studies/Geology",154.80000000000001,5,2014,973,973,null,null,null,"Criminal Justice/Criminology2015","Criminal Justice/Criminology",2015,4672]
[44,"Social Sciences & Helping Professions","AFRICAN AMERICAN STUDIES","Anthropology/Geography/African American studies/Geology",150.3828125,129,2015,907,907,null,null,null,"Criminal Justice/Criminology2016","Criminal Justice/Criminology",2016,4797]
[85,"Social Sciences & Helping Professions","AMERICAN CIVILIZATION","Anthropology/Geography/African American studies/Geology",159.47999999999999,51,2015,907,907,null,null,null,"Economics2002","Economics",2002,3202]
[115,"Social Sciences & Helping Professions","ANTHROPOLOGY","Anthropology/Geography/African American studies/Geology",155.9938272,498,2015,907,907,null,null,null,"Economics2003","Economics",2003,4289]
[160,"Social Sciences & Helping Professions","ARCHEOLOGY","Anthropology/Geography/African American studies/Geology",157.33333329999999,12,2015,907,907,null,null,null,"Economics2004","Economics",2004,5433]
[232,"Social Sciences & Helping Professions","ASIAN AMERICAN STUDIES","Anthropology/Geography/African American studies/Geology",154.4,25,2015,907,907,null,null,null,"Economics2005","Economics",2005,5803]
[852,"Natural Sciences","GEOGRAPHY","Anthropology/Geography/African American studies/Geology",153.0722892,84,2015,907,907,null,null,null,"Economics2006","Economics",2006,5471]
[867,"Natural Sciences","GEOLOGY/ EARTH SCIENCES","Anthropology/Geography/African American studies/Geology",156.82,50,2015,907,907,null,null,null,"Economics2007","Economics",2007,4857]
[1019,"Social Sciences & Helping Professions","INDIAN STUDIES","Anthropology/Geography/African American studies/Geology",147.66666670000001,12,2015,907,907,null,null,null,"Economics2008","Economics",2008,4452]
[1094,"Social Sciences & Helping Professions","INTER AMERICAN RELATIONS","Anthropology/Geography/African American studies/Geology",154.11111109999999,9,2015,907,907,null,null,null,"Economics2009","Economics",2009,4154]
[1324,"Social Sciences & Helping Professions","MEXICAN AMERICAN STUDIES","Anthropology/Geography/African American studies/Geology",151.74193550000001,32,2015,907,907,null,null,null,"Economics2010","Economics",2010,4636]
[1403,"Natural Sciences","OCEANOGRAPHY","Anthropology/Geography/African American studies/Geology",153.80000000000001,5,2015,907,907,null,null,null,"Economics2011","Economics",2011,5147]
[45,"Social Sciences & Helping Professions","AFRICAN AMERICAN STUDIES","Anthropology/Geography/African American studies/Geology",147.11000000000001,107,2016,819,819,null,null,null,"Economics2012","Economics",2012,4422]
[86,"Social Sciences & Helping Professions","AMERICAN CIVILIZATION","Anthropology/Geography/African American studies/Geology",159.05000000000001,41,2016,819,819,null,null,null,"Economics2013","Economics",2013,3617]
[116,"Social Sciences & Helping Professions","ANTHROPOLOGY","Anthropology/Geography/African American studies/Geology",155.9505882,433,2016,819,819,null,null,null,"Economics2014","Economics",2014,3031]
[161,"Social Sciences & Helping Professions","ARCHEOLOGY","Anthropology/Geography/African American studies/Geology",156.4,10,2016,819,819,null,null,null,"Economics2015","Economics",2015,2842]
[233,"Social Sciences & Helping Professions","ASIAN AMERICAN STUDIES","Anthropology/Geography/African American studies/Geology",156.33333329999999,24,2016,819,819,null,null,null,"Economics2016","Economics",2016,2717]
[853,"Natural Sciences","GEOGRAPHY","Anthropology/Geography/African American studies/Geology",154.5,102,2016,819,819,null,null,null,"Education (primary, secondary)/Family relations2002","Education (primary, secondary)/Family relations",2002,1111]
[868,"Natural Sciences","GEOLOGY/ EARTH SCIENCES","Anthropology/Geography/African American studies/Geology",155.17647059999999,52,2016,819,819,null,null,null,"Education (primary, secondary)/Family relations2003","Education (primary, secondary)/Family relations",2003,1136]
[1020,"Social Sciences & Helping Professions","INDIAN STUDIES","Anthropology/Geography/African American studies/Geology",150.69230769999999,14,2016,819,819,null,null,null,"Education (primary, secondary)/Family relations2004","Education (primary, secondary)/Family relations",2004,1135]
[1095,"Social Sciences & Helping Professions","INTER AMERICAN RELATIONS","Anthropology/Geography/African American studies/Geology",154.57142859999999,7,2016,819,819,null,null,null,"Education (primary, secondary)/Family relations2005","Education (primary, secondary)/Family relations",2005,1084]
[1325,"Social Sciences & Helping Professions","MEXICAN AMERICAN STUDIES","Anthropology/Geography/African American studies/Geology",151.96551719999999,29,2016,819,819,null,null,null,"Education (primary, secondary)/Family relations2006","Education (primary, secondary)/Family relations",2006,1020]
[162,"Arts & Humanities","ARCHITECTURE/ENVIRONMENTAL DESIGN","Arts (Music/Art history/Drama/Film/Art design/Perf. arts/Fine arts)",150.7014925,68,2002,1496,1496,null,null,null,"Education (primary, secondary)/Family relations2007","Education (primary, secondary)/Family relations",2007,888]
[177,"Arts & Humanities","ART HISTORY","Arts (Music/Art history/Drama/Film/Art design/Perf. arts/Fine arts)",154.90816330000001,295,2002,1496,1496,null,null,null,"Education (primary, secondary)/Family relations2008","Education (primary, secondary)/Family relations",2008,810]
[192,"Arts & Humanities","ART/DESIGN","Arts (Music/Art history/Drama/Film/Art design/Perf. arts/Fine arts)",148.9370079,129,2002,1496,1496,null,null,null,"Education (primary, secondary)/Family relations2009","Education (primary, secondary)/Family relations",2009,787]
[599,"Arts & Humanities","DRAMA/THEATRE ARTS","Arts (Music/Art history/Drama/Film/Art design/Perf. arts/Fine arts)",154.50359710000001,278,2002,1496,1496,null,null,null,"Education (primary, secondary)/Family relations2010","Education (primary, secondary)/Family relations",2010,752]
[749,"Arts & Humanities","FILM PRODUCTION","Arts (Music/Art history/Drama/Film/Art design/Perf. arts/Fine arts)",153.36440680000001,119,2002,1496,1496,null,null,null,"Education (primary, secondary)/Family relations2011","Education (primary, secondary)/Family relations",2011,755]
[779,"Arts & Humanities","FINE ARTS","Arts (Music/Art history/Drama/Film/Art design/Perf. arts/Fine arts)",150.64516130000001,126,2002,1496,1496,null,null,null,"Education (primary, secondary)/Family relations2012","Education (primary, secondary)/Family relations",2012,738]
[1111,"Arts & Humanities","INTERIOR DESIGN","Arts (Music/Art history/Drama/Film/Art design/Perf. arts/Fine arts)",150.45454549999999,11,2002,1496,1496,null,null,null,"Education (primary, secondary)/Family relations2013","Education (primary, secondary)/Family relations",2013,657]
[1341,"Arts & Humanities","MUSIC","Arts (Music/Art history/Drama/Film/Art design/Perf. arts/Fine arts)",154.1554404,390,2002,1496,1496,null,null,null,"Education (primary, secondary)/Family relations2014","Education (primary, secondary)/Family relations",2014,562]
[1404,"Arts & Humanities","PERFORMING ARTS","Arts (Music/Art history/Drama/Film/Art design/Perf. arts/Fine arts)",153.8846154,52,2002,1496,1496,null,null,null,"Education (primary, secondary)/Family relations2015","Education (primary, secondary)/Family relations",2015,497]
[1934,"Arts & Humanities","VISUAL ARTS/GRAPHICS","Arts (Music/Art history/Drama/Film/Art design/Perf. arts/Fine arts)",150.62962959999999,28,2002,1496,1496,null,null,null,"Education (primary, secondary)/Family relations2016","Education (primary, secondary)/Family relations",2016,517]
[163,"Arts & Humanities","ARCHITECTURE/ENVIRONMENTAL DESIGN","Arts (Music/Art history/Drama/Film/Art design/Perf. arts/Fine arts)",154.08433729999999,83,2003,1917,1917,null,null,null,"Engineering2002","Engineering",2002,2039]
[178,"Arts & Humanities","ART HISTORY","Arts (Music/Art history/Drama/Film/Art design/Perf. arts/Fine arts)",155.84104049999999,347,2003,1917,1917,null,null,null,"Engineering2003","Engineering",2003,2937]
[193,"Arts & Humanities","ART/DESIGN","Arts (Music/Art history/Drama/Film/Art design/Perf. arts/Fine arts)",150.25287359999999,175,2003,1917,1917,null,null,null,"Engineering2004","Engineering",2004,3479]
[600,"Arts & Humanities","DRAMA/THEATRE ARTS","Arts (Music/Art history/Drama/Film/Art design/Perf. arts/Fine arts)",154.19943019999999,353,2003,1917,1917,null,null,null,"Engineering2005","Engineering",2005,3650]
[750,"Arts & Humanities","FILM PRODUCTION","Arts (Music/Art history/Drama/Film/Art design/Perf. arts/Fine arts)",154.06103289999999,214,2003,1917,1917,null,null,null,"Engineering2006","Engineering",2006,3328]
[780,"Arts & Humanities","FINE ARTS","Arts (Music/Art history/Drama/Film/Art design/Perf. arts/Fine arts)",151.95070419999999,142,2003,1917,1917,null,null,null,"Engineering2007","Engineering",2007,2810]
[1112,"Arts & Humanities","INTERIOR DESIGN","Arts (Music/Art history/Drama/Film/Art design/Perf. arts/Fine arts)",149.41176469999999,17,2003,1917,1917,null,null,null,"Engineering2008","Engineering",2008,2463]
[1342,"Arts & Humanities","MUSIC","Arts (Music/Art history/Drama/Film/Art design/Perf. arts/Fine arts)",154.73963130000001,439,2003,1917,1917,null,null,null,"Engineering2009","Engineering",2009,2403]
[1405,"Arts & Humanities","PERFORMING ARTS","Arts (Music/Art history/Drama/Film/Art design/Perf. arts/Fine arts)",151.97499999999999,81,2003,1917,1917,null,null,null,"Engineering2010","Engineering",2010,2307]
[1935,"Arts & Humanities","VISUAL ARTS/GRAPHICS","Arts (Music/Art history/Drama/Film/Art design/Perf. arts/Fine arts)",151.5,66,2003,1917,1917,null,null,null,"Engineering2011","Engineering",2011,2209]
[164,"Arts & Humanities","ARCHITECTURE/ENVIRONMENTAL DESIGN","Arts (Music/Art history/Drama/Film/Art design/Perf. arts/Fine arts)",154.49425289999999,87,2004,2160,2160,null,null,null,"Engineering2012","Engineering",2012,1707]
[179,"Arts & Humanities","ART HISTORY","Arts (Music/Art history/Drama/Film/Art design/Perf. arts/Fine arts)",155.8771084,419,2004,2160,2160,null,null,null,"Engineering2013","Engineering",2013,1304]
[194,"Arts & Humanities","ART/DESIGN","Arts (Music/Art history/Drama/Film/Art design/Perf. arts/Fine arts)",152.1161616,200,2004,2160,{"$f":"VLOOKUP(D194&G194,$M$2:$P$436,4)","v":2160},null,null,null,"Engineering2014","Engineering",2014,1103]
[601,"Arts & Humanities","DRAMA/THEATRE ARTS","Arts (Music/Art history/Drama/Film/Art design/Perf. arts/Fine arts)",154.83827489999999,374,2004,2160,2160,null,null,null,{"$f":"CONCATENATE(N195,O195)","v":"Engineering2015"},"Engineering",2015,958]
[751,"Arts & Humanities","FILM PRODUCTION","Arts (Music/Art history/Drama/Film/Art design/Perf. arts/Fine arts)",154.9906977,219,2004,2160,2160,null,null,null,"Engineering2016","Engineering",2016,952]
[781,"Arts & Humanities","FINE ARTS","Arts (Music/Art history/Drama/Film/Art design/Perf. arts/Fine arts)",152.53797470000001,160,2004,2160,2160,null,null,null,"English/Classics/Literature/Lingusitics2002","English/Classics/Literature/Lingusitics",2002,6674]
[1113,"Arts & Humanities","INTERIOR DESIGN","Arts (Music/Art history/Drama/Film/Art design/Perf. arts/Fine arts)",148.08333329999999,12,2004,2160,2160,null,null,null,"English/Classics/Literature/Lingusitics2003","English/Classics/Literature/Lingusitics",2003,7691]
[1343,"Arts & Humanities","MUSIC","Arts (Music/Art history/Drama/Film/Art design/Perf. arts/Fine arts)",155.08000000000001,526,2004,2160,2160,null,null,null,"English/Classics/Literature/Lingusitics2004","English/Classics/Literature/Lingusitics",2004,8220]
[1406,"Arts & Humanities","PERFORMING ARTS","Arts (Music/Art history/Drama/Film/Art design/Perf. arts/Fine arts)",152.81318680000001,91,2004,2160,2160,null,null,null,"English/Classics/Literature/Lingusitics2005","English/Classics/Literature/Lingusitics",2005,8231]
[1584,"Arts & Humanities","PRACTICAL ARTS","Arts (Music/Art history/Drama/Film/Art design/Perf. arts/Fine arts)",146.5,6,2004,2160,2160,null,null,null,"English/Classics/Literature/Lingusitics2006","English/Classics/Literature/Lingusitics",2006,7964]
[1936,"Arts & Humanities","VISUAL ARTS/GRAPHICS","Arts (Music/Art history/Drama/Film/Art design/Perf. arts/Fine arts)",151.31818179999999,66,2004,2160,2160,null,null,null,"English/Classics/Literature/Lingusitics2007","English/Classics/Literature/Lingusitics",2007,7547]
[165,"Arts & Humanities","ARCHITECTURE/ENVIRONMENTAL DESIGN","Arts (Music/Art history/Drama/Film/Art design/Perf. arts/Fine arts)",154.98850569999999,88,2005,2468,2468,null,null,null,"English/Classics/Literature/Lingusitics2008","English/Classics/Literature/Lingusitics",2008,7347]
[180,"Arts & Humanities","ART HISTORY","Arts (Music/Art history/Drama/Film/Art design/Perf. arts/Fine arts)",156.3747228,456,2005,2468,2468,null,null,null,"English/Classics/Literature/Lingusitics2009","English/Classics/Literature/Lingusitics",2009,7209]
[195,"Arts & Humanities","ART/DESIGN","Arts (Music/Art history/Drama/Film/Art design/Perf. arts/Fine arts)",153.02868849999999,246,2005,2468,2468,null,null,null,"English/Classics/Literature/Lingusitics2010","English/Classics/Literature/Lingusitics",2010,7189]
[602,"Arts & Humanities","DRAMA/THEATRE ARTS","Arts (Music/Art history/Drama/Film/Art design/Perf. arts/Fine arts)",155.72572819999999,416,2005,2468,2468,null,null,null,"English/Classics/Literature/Lingusitics2011","English/Classics/Literature/Lingusitics",2011,7240]
[752,"Arts & Humanities","FILM PRODUCTION","Arts (Music/Art history/Drama/Film/Art design/Perf. arts/Fine arts)",154.83805670000001,250,2005,2468,2468,null,null,null,"English/Classics/Literature/Lingusitics2012","English/Classics/Literature/Lingusitics",2012,6473]
[782,"Arts & Humanities","FINE ARTS","Arts (Music/Art history/Drama/Film/Art design/Perf. arts/Fine arts)",152.99509800000001,206,2005,2468,2468,null,null,null,"English/Classics/Literature/Lingusitics2013","English/Classics/Literature/Lingusitics",2013,5563]
[1114,"Arts & Humanities","INTERIOR DESIGN","Arts (Music/Art history/Drama/Film/Art design/Perf. arts/Fine arts)",148.2857143,14,2005,2468,2468,null,null,null,"English/Classics/Literature/Lingusitics2014","English/Classics/Literature/Lingusitics",2014,4796]
[1344,"Arts & Humanities","MUSIC","Arts (Music/Art history/Drama/Film/Art design/Perf. arts/Fine arts)",155.0216216,561,2005,2468,2468,null,null,null,"English/Classics/Literature/Lingusitics2015","English/Classics/Literature/Lingusitics",2015,4390]
[1407,"Arts & Humanities","PERFORMING ARTS","Arts (Music/Art history/Drama/Film/Art design/Perf. arts/Fine arts)",152.4160584,139,2005,2468,2468,null,null,null,"English/Classics/Literature/Lingusitics2016","English/Classics/Literature/Lingusitics",2016,4195]
[1585,"Arts & Humanities","PRACTICAL ARTS","Arts (Music/Art history/Drama/Film/Art design/Perf. arts/Fine arts)",147.91666670000001,12,2005,2468,2468,null,null,null,"Finance & Insueance2002","Finance & Insueance",2002,2285]
[1937,"Arts & Humanities","VISUAL ARTS/GRAPHICS","Arts (Music/Art history/Drama/Film/Art design/Perf. arts/Fine arts)",151.75949370000001,80,2005,2468,2468,null,null,null,"Finance & Insueance2003","Finance & Insueance",2003,3165]
[166,"Arts & Humanities","ARCHITECTURE/ENVIRONMENTAL DESIGN","Arts (Music/Art history/Drama/Film/Art design/Perf. arts/Fine arts)",154.41176469999999,85,2006,2257,2257,null,null,null,"Finance & Insueance2004","Finance & Insueance",2004,4132]
[181,"Arts & Humanities","ART HISTORY","Arts (Music/Art history/Drama/Film/Art design/Perf. arts/Fine arts)",156.2238806,403,2006,2257,2257,null,null,null,"Finance & Insueance2005","Finance & Insueance",2005,4288]
[196,"Arts & Humanities","ART/DESIGN","Arts (Music/Art history/Drama/Film/Art design/Perf. arts/Fine arts)",152.37563449999999,197,2006,2257,2257,null,null,null,"Finance & Insueance2006","Finance & Insueance",2006,3827]
[603,"Arts & Humanities","DRAMA/THEATRE ARTS","Arts (Music/Art history/Drama/Film/Art design/Perf. arts/Fine arts)",155.30769230000001,366,2006,2257,2257,null,null,null,"Finance & Insueance2007","Finance & Insueance",2007,3237]
[753,"Arts & Humanities","FILM PRODUCTION","Arts (Music/Art history/Drama/Film/Art design/Perf. arts/Fine arts)",155.25691699999999,254,2006,2257,2257,null,null,null,"Finance & Insueance2008","Finance & Insueance",2008,2947]
[783,"Arts & Humanities","FINE ARTS","Arts (Music/Art history/Drama/Film/Art design/Perf. arts/Fine arts)",152.26315790000001,153,2006,2257,2257,null,null,null,"Finance & Insueance2009","Finance & Insueance",2009,2762]
[1115,"Arts & Humanities","INTERIOR DESIGN","Arts (Music/Art history/Drama/Film/Art design/Perf. arts/Fine arts)",149.57142859999999,7,2006,2257,2257,null,null,null,"Finance & Insueance2010","Finance & Insueance",2010,3313]
[1345,"Arts & Humanities","MUSIC","Arts (Music/Art history/Drama/Film/Art design/Perf. arts/Fine arts)",155.50973450000001,568,2006,2257,2257,null,null,null,"Finance & Insueance2011","Finance & Insueance",2011,3710]
[1408,"Arts & Humanities","PERFORMING ARTS","Arts (Music/Art history/Drama/Film/Art design/Perf. arts/Fine arts)",154.6692913,128,2006,2257,2257,null,null,null,"Finance & Insueance2012","Finance & Insueance",2012,3020]
[1586,"Arts & Humanities","PRACTICAL ARTS","Arts (Music/Art history/Drama/Film/Art design/Perf. arts/Fine arts)",147.47058820000001,17,2006,2257,2257,null,null,null,"Finance & Insueance2013","Finance & Insueance",2013,2351]
[1938,"Arts & Humanities","VISUAL ARTS/GRAPHICS","Arts (Music/Art history/Drama/Film/Art design/Perf. arts/Fine arts)",154.4177215,79,2006,2257,2257,null,null,null,"Finance & Insueance2014","Finance & Insueance",2014,1891]
[167,"Arts & Humanities","ARCHITECTURE/ENVIRONMENTAL DESIGN","Arts (Music/Art history/Drama/Film/Art design/Perf. arts/Fine arts)",154.6619718,72,2007,2196,2196,null,null,null,"Finance & Insueance2015","Finance & Insueance",2015,1601]
[182,"Arts & Humanities","ART HISTORY","Arts (Music/Art history/Drama/Film/Art design/Perf. arts/Fine arts)",156.40561220000001,392,2007,2196,2196,null,null,null,"Finance & Insueance2016","Finance & Insueance",2016,1510]
[197,"Arts & Humanities","ART/DESIGN","Arts (Music/Art history/Drama/Film/Art design/Perf. arts/Fine arts)",152.23404260000001,188,2007,2196,2196,null,null,null,"Foreign languages (Spanish, French, German, Russian)2002","Foreign languages (Spanish, French, German, Russian)",2002,2272]
[604,"Arts & Humanities","DRAMA/THEATRE ARTS","Arts (Music/Art history/Drama/Film/Art design/Perf. arts/Fine arts)",155.27297300000001,371,2007,2196,2196,null,null,null,"Foreign languages (Spanish, French, German, Russian)2003","Foreign languages (Spanish, French, German, Russian)",2003,2597]
[754,"Arts & Humanities","FILM PRODUCTION","Arts (Music/Art history/Drama/Film/Art design/Perf. arts/Fine arts)",155.57307689999999,260,2007,2196,2196,null,null,null,"Foreign languages (Spanish, French, German, Russian)2004","Foreign languages (Spanish, French, German, Russian)",2004,2991]
[784,"Arts & Humanities","FINE ARTS","Arts (Music/Art history/Drama/Film/Art design/Perf. arts/Fine arts)",152.63120570000001,141,2007,2196,2196,null,null,null,"Foreign languages (Spanish, French, German, Russian)2005","Foreign languages (Spanish, French, German, Russian)",2005,3317]
[1116,"Arts & Humanities","INTERIOR DESIGN","Arts (Music/Art history/Drama/Film/Art design/Perf. arts/Fine arts)",149.66666670000001,6,2007,2196,2196,null,null,null,"Foreign languages (Spanish, French, German, Russian)2006","Foreign languages (Spanish, French, German, Russian)",2006,3291]
[1346,"Arts & Humanities","MUSIC","Arts (Music/Art history/Drama/Film/Art design/Perf. arts/Fine arts)",156.0629496,561,2007,2196,2196,null,null,null,"Foreign languages (Spanish, French, German, Russian)2007","Foreign languages (Spanish, French, German, Russian)",2007,3166]
[1409,"Arts & Humanities","PERFORMING ARTS","Arts (Music/Art history/Drama/Film/Art design/Perf. arts/Fine arts)",154.075188,133,2007,2196,2196,null,null,null,"Foreign languages (Spanish, French, German, Russian)2008","Foreign languages (Spanish, French, German, Russian)",2008,3185]
[1587,"Arts & Humanities","PRACTICAL ARTS","Arts (Music/Art history/Drama/Film/Art design/Perf. arts/Fine arts)",149.94444440000001,18,2007,2196,2196,null,null,null,"Foreign languages (Spanish, French, German, Russian)2009","Foreign languages (Spanish, French, German, Russian)",2009,3128]
[1939,"Arts & Humanities","VISUAL ARTS/GRAPHICS","Arts (Music/Art history/Drama/Film/Art design/Perf. arts/Fine arts)",150.29629629999999,54,2007,2196,2196,null,null,null,"Foreign languages (Spanish, French, German, Russian)2010","Foreign languages (Spanish, French, German, Russian)",2010,3222]
[168,"Arts & Humanities","ARCHITECTURE/ENVIRONMENTAL DESIGN","Arts (Music/Art history/Drama/Film/Art design/Perf. arts/Fine arts)",155.8846154,78,2008,2072,2072,null,null,null,"Foreign languages (Spanish, French, German, Russian)2011","Foreign languages (Spanish, French, German, Russian)",2011,3436]
[183,"Arts & Humanities","ART HISTORY","Arts (Music/Art history/Drama/Film/Art design/Perf. arts/Fine arts)",156.15270939999999,407,2008,2072,2072,null,null,null,"Foreign languages (Spanish, French, German, Russian)2012","Foreign languages (Spanish, French, German, Russian)",2012,2898]
[198,"Arts & Humanities","ART/DESIGN","Arts (Music/Art history/Drama/Film/Art design/Perf. arts/Fine arts)",152.5722543,173,2008,2072,2072,null,null,null,"Foreign languages (Spanish, French, German, Russian)2013","Foreign languages (Spanish, French, German, Russian)",2013,2416]
[605,"Arts & Humanities","DRAMA/THEATRE ARTS","Arts (Music/Art history/Drama/Film/Art design/Perf. arts/Fine arts)",155.48376619999999,308,2008,2072,2072,null,null,null,"Foreign languages (Spanish, French, German, Russian)2014","Foreign languages (Spanish, French, German, Russian)",2014,2130]
[755,"Arts & Humanities","FILM PRODUCTION","Arts (Music/Art history/Drama/Film/Art design/Perf. arts/Fine arts)",156.25,227,2008,2072,2072,null,null,null,"Foreign languages (Spanish, French, German, Russian)2015","Foreign languages (Spanish, French, German, Russian)",2015,1968]
[785,"Arts & Humanities","FINE ARTS","Arts (Music/Art history/Drama/Film/Art design/Perf. arts/Fine arts)",152.1935484,157,2008,2072,2072,null,null,null,"Foreign languages (Spanish, French, German, Russian)2016","Foreign languages (Spanish, French, German, Russian)",2016,1808]
[1117,"Arts & Humanities","INTERIOR DESIGN","Arts (Music/Art history/Drama/Film/Art design/Perf. arts/Fine arts)",152,7,2008,2072,2072,null,null,null,"Goverment/Service2002","Goverment/Service",2002,823]
[1347,"Arts & Humanities","MUSIC","Arts (Music/Art history/Drama/Film/Art design/Perf. arts/Fine arts)",156.22779919999999,519,2008,2072,2072,null,null,null,"Goverment/Service2003","Goverment/Service",2003,892]
[1410,"Arts & Humanities","PERFORMING ARTS","Arts (Music/Art history/Drama/Film/Art design/Perf. arts/Fine arts)",154.38888890000001,126,2008,2072,2072,null,null,null,"Goverment/Service2004","Goverment/Service",2004,966]
[1588,"Arts & Humanities","PRACTICAL ARTS","Arts (Music/Art history/Drama/Film/Art design/Perf. arts/Fine arts)",145.41666670000001,12,2008,2072,2072,null,null,null,"Goverment/Service2005","Goverment/Service",2005,856]
[1940,"Arts & Humanities","VISUAL ARTS/GRAPHICS","Arts (Music/Art history/Drama/Film/Art design/Perf. arts/Fine arts)",154.17241379999999,58,2008,2072,2072,null,null,null,"Goverment/Service2006","Goverment/Service",2006,865]
[169,"Arts & Humanities","ARCHITECTURE/ENVIRONMENTAL DESIGN","Arts (Music/Art history/Drama/Film/Art design/Perf. arts/Fine arts)",154.32758620000001,58,2009,2070,2070,null,null,null,"Goverment/Service2007","Goverment/Service",2007,799]
[184,"Arts & Humanities","ART HISTORY","Arts (Music/Art history/Drama/Film/Art design/Perf. arts/Fine arts)",156.0314961,381,2009,2070,2070,null,null,null,"Goverment/Service2008","Goverment/Service",2008,771]
[199,"Arts & Humanities","ART/DESIGN","Arts (Music/Art history/Drama/Film/Art design/Perf. arts/Fine arts)",152.69767440000001,175,2009,2070,2070,null,null,null,"Goverment/Service2009","Goverment/Service",2009,749]
[606,"Arts & Humanities","DRAMA/THEATRE ARTS","Arts (Music/Art history/Drama/Film/Art design/Perf. arts/Fine arts)",155.34355830000001,326,2009,2070,2070,null,null,null,"Goverment/Service2010","Goverment/Service",2010,751]
[756,"Arts & Humanities","FILM PRODUCTION","Arts (Music/Art history/Drama/Film/Art design/Perf. arts/Fine arts)",156.59243699999999,238,2009,2070,2070,null,null,null,"Goverment/Service2011","Goverment/Service",2011,767]
[786,"Arts & Humanities","FINE ARTS","Arts (Music/Art history/Drama/Film/Art design/Perf. arts/Fine arts)",151.30708659999999,130,2009,2070,2070,null,null,null,"Goverment/Service2012","Goverment/Service",2012,727]
[1118,"Arts & Humanities","INTERIOR DESIGN","Arts (Music/Art history/Drama/Film/Art design/Perf. arts/Fine arts)",148.2857143,7,2009,2070,2070,null,null,null,"Goverment/Service2013","Goverment/Service",2013,587]
[1348,"Arts & Humanities","MUSIC","Arts (Music/Art history/Drama/Film/Art design/Perf. arts/Fine arts)",156.09689209999999,549,2009,2070,2070,null,null,null,"Goverment/Service2014","Goverment/Service",2014,513]
[1411,"Arts & Humanities","PERFORMING ARTS","Arts (Music/Art history/Drama/Film/Art design/Perf. arts/Fine arts)",154.71666669999999,121,2009,2070,2070,null,null,null,"Goverment/Service2015","Goverment/Service",2015,501]
[1589,"Arts & Humanities","PRACTICAL ARTS","Arts (Music/Art history/Drama/Film/Art design/Perf. arts/Fine arts)",149.18181820000001,11,2009,2070,2070,null,null,null,"Goverment/Service2016","Goverment/Service",2016,513]
[1941,"Arts & Humanities","VISUAL ARTS/GRAPHICS","Arts (Music/Art history/Drama/Film/Art design/Perf. arts/Fine arts)",153.3150685,74,2009,2070,2070,null,null,null,"Health professions (nursing, kinesiology, premed, health care admin.)2002","Health professions (nursing, kinesiology, premed, health care admin.)",2002,1542]
[170,"Arts & Humanities","ARCHITECTURE/ENVIRONMENTAL DESIGN","Arts (Music/Art history/Drama/Film/Art design/Perf. arts/Fine arts)",153.72,75,2010,2276,{"$f":"VLOOKUP(D258&G258,$M$2:$P$436,4)","v":2276},null,null,null,"Health professions (nursing, kinesiology, premed, health care admin.)2003","Health professions (nursing, kinesiology, premed, health care admin.)",2003,1557]
[185,"Arts & Humanities","ART HISTORY","Arts (Music/Art history/Drama/Film/Art design/Perf. arts/Fine arts)",157.0669546,466,2010,2276,2276,null,null,null,{"$f":"CONCATENATE(N259,O259)","v":"Health professions (nursing, kinesiology, premed, health care admin.)2004"},"Health professions (nursing, kinesiology, premed, health care admin.)",2004,1312]
[200,"Arts & Humanities","ART/DESIGN","Arts (Music/Art history/Drama/Film/Art design/Perf. arts/Fine arts)",152.99397590000001,166,2010,2276,2276,null,null,null,"Health professions (nursing, kinesiology, premed, health care admin.)2005","Health professions (nursing, kinesiology, premed, health care admin.)",2005,1243]
[607,"Arts & Humanities","DRAMA/THEATRE ARTS","Arts (Music/Art history/Drama/Film/Art design/Perf. arts/Fine arts)",155.65417869999999,348,2010,2276,2276,null,null,null,"Health professions (nursing, kinesiology, premed, health care admin.)2006","Health professions (nursing, kinesiology, premed, health care admin.)",2006,1041]
[757,"Arts & Humanities","FILM PRODUCTION","Arts (Music/Art history/Drama/Film/Art design/Perf. arts/Fine arts)",155.91338579999999,254,2010,2276,2276,null,null,null,"Health professions (nursing, kinesiology, premed, health care admin.)2007","Health professions (nursing, kinesiology, premed, health care admin.)",2007,914]
[787,"Arts & Humanities","FINE ARTS","Arts (Music/Art history/Drama/Film/Art design/Perf. arts/Fine arts)",151.76223780000001,144,2010,2276,2276,null,null,null,"Health professions (nursing, kinesiology, premed, health care admin.)2008","Health professions (nursing, kinesiology, premed, health care admin.)",2008,845]
[1119,"Arts & Humanities","INTERIOR DESIGN","Arts (Music/Art history/Drama/Film/Art design/Perf. arts/Fine arts)",144.72727269999999,12,2010,2276,2276,null,null,null,"Health professions (nursing, kinesiology, premed, health care admin.)2009","Health professions (nursing, kinesiology, premed, health care admin.)",2009,879]
[1349,"Arts & Humanities","MUSIC","Arts (Music/Art history/Drama/Film/Art design/Perf. arts/Fine arts)",156.6804836,579,2010,2276,2276,null,null,null,"Health professions (nursing, kinesiology, premed, health care admin.)2010","Health professions (nursing, kinesiology, premed, health care admin.)",2010,890]
[1412,"Arts & Humanities","PERFORMING ARTS","Arts (Music/Art history/Drama/Film/Art design/Perf. arts/Fine arts)",152.4931507,146,2010,2276,2276,null,null,null,"Health professions (nursing, kinesiology, premed, health care admin.)2011","Health professions (nursing, kinesiology, premed, health care admin.)",2011,857]
[1590,"Arts & Humanities","PRACTICAL ARTS","Arts (Music/Art history/Drama/Film/Art design/Perf. arts/Fine arts)",141.88888890000001,9,2010,2276,2276,null,null,null,"Health professions (nursing, kinesiology, premed, health care admin.)2012","Health professions (nursing, kinesiology, premed, health care admin.)",2012,831]
[1942,"Arts & Humanities","VISUAL ARTS/GRAPHICS","Arts (Music/Art history/Drama/Film/Art design/Perf. arts/Fine arts)",153.2857143,77,2010,2276,2276,null,null,null,"Health professions (nursing, kinesiology, premed, health care admin.)2013","Health professions (nursing, kinesiology, premed, health care admin.)",2013,729]
[171,"Arts & Humanities","ARCHITECTURE/ENVIRONMENTAL DESIGN","Arts (Music/Art history/Drama/Film/Art design/Perf. arts/Fine arts)",155.73404260000001,95,2011,2427,2427,null,null,null,"Health professions (nursing, kinesiology, premed, health care admin.)2014","Health professions (nursing, kinesiology, premed, health care admin.)",2014,683]
[186,"Arts & Humanities","ART HISTORY","Arts (Music/Art history/Drama/Film/Art design/Perf. arts/Fine arts)",156.76645439999999,472,2011,2427,2427,null,null,null,"Health professions (nursing, kinesiology, premed, health care admin.)2015","Health professions (nursing, kinesiology, premed, health care admin.)",2015,683]
[201,"Arts & Humanities","ART/DESIGN","Arts (Music/Art history/Drama/Film/Art design/Perf. arts/Fine arts)",153.4954955,224,2011,2427,2427,null,null,null,"Health professions (nursing, kinesiology, premed, health care admin.)2016","Health professions (nursing, kinesiology, premed, health care admin.)",2016,755]
[608,"Arts & Humanities","DRAMA/THEATRE ARTS","Arts (Music/Art history/Drama/Film/Art design/Perf. arts/Fine arts)",155.9937888,323,2011,2427,2427,null,null,null,"History2002","History",2002,6296]
[758,"Arts & Humanities","FILM PRODUCTION","Arts (Music/Art history/Drama/Film/Art design/Perf. arts/Fine arts)",155.83720930000001,301,2011,2427,2427,null,null,null,"History2003","History",2003,6455]
[788,"Arts & Humanities","FINE ARTS","Arts (Music/Art history/Drama/Film/Art design/Perf. arts/Fine arts)",153.89102560000001,158,2011,2427,2427,null,null,null,"History2004","History",2004,6139]
[1120,"Arts & Humanities","INTERIOR DESIGN","Arts (Music/Art history/Drama/Film/Art design/Perf. arts/Fine arts)",148.125,16,2011,2427,2427,null,null,null,"History2005","History",2005,6013]
[1350,"Arts & Humanities","MUSIC","Arts (Music/Art history/Drama/Film/Art design/Perf. arts/Fine arts)",157.03275859999999,581,2011,2427,2427,null,null,null,"History2006","History",2006,5998]
[1413,"Arts & Humanities","PERFORMING ARTS","Arts (Music/Art history/Drama/Film/Art design/Perf. arts/Fine arts)",154.378882,161,2011,2427,2427,null,null,null,"History2007","History",2007,6068]
[1591,"Arts & Humanities","PRACTICAL ARTS","Arts (Music/Art history/Drama/Film/Art design/Perf. arts/Fine arts)",146.25,12,2011,2427,2427,null,null,null,"History2008","History",2008,5894]
[1943,"Arts & Humanities","VISUAL ARTS/GRAPHICS","Arts (Music/Art history/Drama/Film/Art design/Perf. arts/Fine arts)",155.5180723,84,2011,2427,2427,null,null,null,"History2009","History",2009,5689]
[172,"Arts & Humanities","ARCHITECTURE/ENVIRONMENTAL DESIGN","Arts (Music/Art history/Drama/Film/Art design/Perf. arts/Fine arts)",154.5747126,88,2012,2079,2079,null,null,null,"History2010","History",2010,6069]
[187,"Arts & Humanities","ART HISTORY","Arts (Music/Art history/Drama/Film/Art design/Perf. arts/Fine arts)",157.21832879999999,371,2012,2079,2079,null,null,null,"History2011","History",2011,5848]
[202,"Arts & Humanities","ART/DESIGN","Arts (Music/Art history/Drama/Film/Art design/Perf. arts/Fine arts)",152.17910449999999,203,2012,2079,2079,null,null,null,"History2012","History",2012,5424]
[609,"Arts & Humanities","DRAMA/THEATRE ARTS","Arts (Music/Art history/Drama/Film/Art design/Perf. arts/Fine arts)",156.3816794,265,2012,2079,2079,null,null,null,"History2013","History",2013,4698]
[759,"Arts & Humanities","FILM PRODUCTION","Arts (Music/Art history/Drama/Film/Art design/Perf. arts/Fine arts)",156.2510638,236,2012,2079,2079,null,null,null,"History2014","History",2014,4061]
[789,"Arts & Humanities","FINE ARTS","Arts (Music/Art history/Drama/Film/Art design/Perf. arts/Fine arts)",152.08759119999999,137,2012,2079,2079,null,null,null,"History2015","History",2015,3729]
[1121,"Arts & Humanities","INTERIOR DESIGN","Arts (Music/Art history/Drama/Film/Art design/Perf. arts/Fine arts)",144.25,12,2012,2079,2079,null,null,null,"History2016","History",2016,3472]
[1351,"Arts & Humanities","MUSIC","Arts (Music/Art history/Drama/Film/Art design/Perf. arts/Fine arts)",156.5307263,540,2012,2079,2079,null,null,null,"Interdisciplinary Studies2002","Interdisciplinary Studies",2002,470]
[1414,"Arts & Humanities","PERFORMING ARTS","Arts (Music/Art history/Drama/Film/Art design/Perf. arts/Fine arts)",155.5985915,142,2012,2079,2079,null,null,null,"Interdisciplinary Studies2003","Interdisciplinary Studies",2003,563]
[1592,"Arts & Humanities","PRACTICAL ARTS","Arts (Music/Art history/Drama/Film/Art design/Perf. arts/Fine arts)",150.66666670000001,6,2012,2079,2079,null,null,null,"Interdisciplinary Studies2004","Interdisciplinary Studies",2004,742]
[1944,"Arts & Humanities","VISUAL ARTS/GRAPHICS","Arts (Music/Art history/Drama/Film/Art design/Perf. arts/Fine arts)",152.17948720000001,79,2012,2079,2079,null,null,null,"Interdisciplinary Studies2005","Interdisciplinary Studies",2005,889]
[173,"Arts & Humanities","ARCHITECTURE/ENVIRONMENTAL DESIGN","Arts (Music/Art history/Drama/Film/Art design/Perf. arts/Fine arts)",156.05000000000001,61,2013,1666,1666,null,null,null,"Interdisciplinary Studies2006","Interdisciplinary Studies",2006,852]
[188,"Arts & Humanities","ART HISTORY","Arts (Music/Art history/Drama/Film/Art design/Perf. arts/Fine arts)",157.10921500000001,293,2013,1666,1666,null,null,null,"Interdisciplinary Studies2007","Interdisciplinary Studies",2007,777]
[203,"Arts & Humanities","ART/DESIGN","Arts (Music/Art history/Drama/Film/Art design/Perf. arts/Fine arts)",151.03125,161,2013,1666,1666,null,null,null,"Interdisciplinary Studies2008","Interdisciplinary Studies",2008,788]
[610,"Arts & Humanities","DRAMA/THEATRE ARTS","Arts (Music/Art history/Drama/Film/Art design/Perf. arts/Fine arts)",155.03319500000001,242,2013,1666,1666,null,null,null,"Interdisciplinary Studies2009","Interdisciplinary Studies",2009,855]
[760,"Arts & Humanities","FILM PRODUCTION","Arts (Music/Art history/Drama/Film/Art design/Perf. arts/Fine arts)",156.38028170000001,214,2013,1666,1666,null,null,null,"Interdisciplinary Studies2010","Interdisciplinary Studies",2010,899]
[790,"Arts & Humanities","FINE ARTS","Arts (Music/Art history/Drama/Film/Art design/Perf. arts/Fine arts)",151.827957,93,2013,1666,1666,null,null,null,"Interdisciplinary Studies2011","Interdisciplinary Studies",2011,916]
[1122,"Arts & Humanities","INTERIOR DESIGN","Arts (Music/Art history/Drama/Film/Art design/Perf. arts/Fine arts)",147.36363639999999,11,2013,1666,1666,null,null,null,"Interdisciplinary Studies2012","Interdisciplinary Studies",2012,793]
[1352,"Arts & Humanities","MUSIC","Arts (Music/Art history/Drama/Film/Art design/Perf. arts/Fine arts)",156.84057970000001,415,2013,1666,1666,null,null,null,"Interdisciplinary Studies2013","Interdisciplinary Studies",2013,680]
[1415,"Arts & Humanities","PERFORMING ARTS","Arts (Music/Art history/Drama/Film/Art design/Perf. arts/Fine arts)",153.87610620000001,115,2013,1666,1666,null,null,null,"Interdisciplinary Studies2014","Interdisciplinary Studies",2014,638]
[1593,"Arts & Humanities","PRACTICAL ARTS","Arts (Music/Art history/Drama/Film/Art design/Perf. arts/Fine arts)",151,9,2013,1666,1666,null,null,null,"Interdisciplinary Studies2015","Interdisciplinary Studies",2015,587]
[1945,"Arts & Humanities","VISUAL ARTS/GRAPHICS","Arts (Music/Art history/Drama/Film/Art design/Perf. arts/Fine arts)",152.19999999999999,52,2013,1666,1666,null,null,null,"Interdisciplinary Studies2016","Interdisciplinary Studies",2016,538]
[174,"Arts & Humanities","ARCHITECTURE/ENVIRONMENTAL DESIGN","Arts (Music/Art history/Drama/Film/Art design/Perf. arts/Fine arts)",156.30769230000001,39,2014,1353,1353,null,null,null,"International relations/International studies2002","International relations/International studies",2002,1533]
[189,"Arts & Humanities","ART HISTORY","Arts (Music/Art history/Drama/Film/Art design/Perf. arts/Fine arts)",157.44206009999999,234,2014,1353,1353,null,null,null,"International relations/International studies2003","International relations/International studies",2003,1834]
[204,"Arts & Humanities","ART/DESIGN","Arts (Music/Art history/Drama/Film/Art design/Perf. arts/Fine arts)",151.24799999999999,126,2014,1353,1353,null,null,null,"International relations/International studies2004","International relations/International studies",2004,1963]
[611,"Arts & Humanities","DRAMA/THEATRE ARTS","Arts (Music/Art history/Drama/Film/Art design/Perf. arts/Fine arts)",154.04069770000001,177,2014,1353,1353,null,null,null,"International relations/International studies2005","International relations/International studies",2005,2068]
[761,"Arts & Humanities","FILM PRODUCTION","Arts (Music/Art history/Drama/Film/Art design/Perf. arts/Fine arts)",153.90116280000001,175,2014,1353,1353,null,null,null,"International relations/International studies2006","International relations/International studies",2006,2050]
[791,"Arts & Humanities","FINE ARTS","Arts (Music/Art history/Drama/Film/Art design/Perf. arts/Fine arts)",151.94186049999999,87,2014,1353,1353,null,null,null,"International relations/International studies2007","International relations/International studies",2007,2114]
[1123,"Arts & Humanities","INTERIOR DESIGN","Arts (Music/Art history/Drama/Film/Art design/Perf. arts/Fine arts)",152.33333329999999,6,2014,1353,1353,null,null,null,"International relations/International studies2008","International relations/International studies",2008,1988]
[1353,"Arts & Humanities","MUSIC","Arts (Music/Art history/Drama/Film/Art design/Perf. arts/Fine arts)",156.08947370000001,382,2014,1353,1353,null,null,null,"International relations/International studies2009","International relations/International studies",2009,2011]
[1416,"Arts & Humanities","PERFORMING ARTS","Arts (Music/Art history/Drama/Film/Art design/Perf. arts/Fine arts)",155.10465120000001,86,2014,1353,1353,null,null,null,"International relations/International studies2010","International relations/International studies",2010,2377]
[1594,"Arts & Humanities","PRACTICAL ARTS","Arts (Music/Art history/Drama/Film/Art design/Perf. arts/Fine arts)",144.7777778,9,2014,1353,1353,null,null,null,"International relations/International studies2011","International relations/International studies",2011,2598]
[1946,"Arts & Humanities","VISUAL ARTS/GRAPHICS","Arts (Music/Art history/Drama/Film/Art design/Perf. arts/Fine arts)",153.83870970000001,32,2014,1353,1353,null,null,null,"International relations/International studies2012","International relations/International studies",2012,2529]
[175,"Arts & Humanities","ARCHITECTURE/ENVIRONMENTAL DESIGN","Arts (Music/Art history/Drama/Film/Art design/Perf. arts/Fine arts)",154.9722222,39,2015,1257,1257,null,null,null,"International relations/International studies2013","International relations/International studies",2013,2262]
[190,"Arts & Humanities","ART HISTORY","Arts (Music/Art history/Drama/Film/Art design/Perf. arts/Fine arts)",158.16814160000001,230,2015,1257,1257,null,null,null,"International relations/International studies2014","International relations/International studies",2014,1932]
[205,"Arts & Humanities","ART/DESIGN","Arts (Music/Art history/Drama/Film/Art design/Perf. arts/Fine arts)",151.4188034,121,2015,1257,1257,null,null,null,"International relations/International studies2015","International relations/International studies",2015,1904]
[612,"Arts & Humanities","DRAMA/THEATRE ARTS","Arts (Music/Art history/Drama/Film/Art design/Perf. arts/Fine arts)",155.25786160000001,160,2015,1257,1257,null,null,null,"International relations/International studies2016","International relations/International studies",2016,1738]
[762,"Arts & Humanities","FILM PRODUCTION","Arts (Music/Art history/Drama/Film/Art design/Perf. arts/Fine arts)",153.37058819999999,171,2015,1257,1257,null,null,null,"Liberal arts/Other arts and humanities2002","Liberal arts/Other arts and humanities",2002,2403]
[792,"Arts & Humanities","FINE ARTS","Arts (Music/Art history/Drama/Film/Art design/Perf. arts/Fine arts)",153.8142857,73,2015,1257,1257,null,null,null,"Liberal arts/Other arts and humanities2003","Liberal arts/Other arts and humanities",2003,3445]
[1354,"Arts & Humanities","MUSIC","Arts (Music/Art history/Drama/Film/Art design/Perf. arts/Fine arts)",156.1003236,318,2015,1257,1257,null,null,null,"Liberal arts/Other arts and humanities2004","Liberal arts/Other arts and humanities",2004,4329]
[1417,"Arts & Humanities","PERFORMING ARTS","Arts (Music/Art history/Drama/Film/Art design/Perf. arts/Fine arts)",154.0434783,93,2015,1257,1257,null,null,null,"Liberal arts/Other arts and humanities2005","Liberal arts/Other arts and humanities",2005,5217]
[1595,"Arts & Humanities","PRACTICAL ARTS","Arts (Music/Art history/Drama/Film/Art design/Perf. arts/Fine arts)",145.66666670000001,9,2015,1257,1257,null,null,null,"Liberal arts/Other arts and humanities2006","Liberal arts/Other arts and humanities",2006,5451]
[1947,"Arts & Humanities","VISUAL ARTS/GRAPHICS","Arts (Music/Art history/Drama/Film/Art design/Perf. arts/Fine arts)",153.2790698,43,2015,1257,{"$f":"VLOOKUP(D322&G322,$M$2:$P$436,4)","v":1257},null,null,null,"Liberal arts/Other arts and humanities2007","Liberal arts/Other arts and humanities",2007,4986]
[176,"Arts & Humanities","ARCHITECTURE/ENVIRONMENTAL DESIGN","Arts (Music/Art history/Drama/Film/Art design/Perf. arts/Fine arts)",155.13793100000001,29,2016,1263,1263,null,null,null,{"$f":"CONCATENATE(N323,O323)","v":"Liberal arts/Other arts and humanities2008"},"Liberal arts/Other arts and humanities",2008,4555]
[191,"Arts & Humanities","ART HISTORY","Arts (Music/Art history/Drama/Film/Art design/Perf. arts/Fine arts)",156.4596774,253,2016,1263,1263,null,null,null,"Liberal arts/Other arts and humanities2009","Liberal arts/Other arts and humanities",2009,4720]
[206,"Arts & Humanities","ART/DESIGN","Arts (Music/Art history/Drama/Film/Art design/Perf. arts/Fine arts)",150.7657658,111,2016,1263,1263,null,null,null,"Liberal arts/Other arts and humanities2010","Liberal arts/Other arts and humanities",2010,4757]
[613,"Arts & Humanities","DRAMA/THEATRE ARTS","Arts (Music/Art history/Drama/Film/Art design/Perf. arts/Fine arts)",154.95854919999999,198,2016,1263,1263,null,null,null,"Liberal arts/Other arts and humanities2011","Liberal arts/Other arts and humanities",2011,4778]
[763,"Arts & Humanities","FILM PRODUCTION","Arts (Music/Art history/Drama/Film/Art design/Perf. arts/Fine arts)",154.48780489999999,167,2016,1263,1263,null,null,null,"Liberal arts/Other arts and humanities2012","Liberal arts/Other arts and humanities",2012,4201]
[793,"Arts & Humanities","FINE ARTS","Arts (Music/Art history/Drama/Film/Art design/Perf. arts/Fine arts)",151.79365079999999,64,2016,1263,1263,null,null,null,"Liberal arts/Other arts and humanities2013","Liberal arts/Other arts and humanities",2013,3805]
[1355,"Arts & Humanities","MUSIC","Arts (Music/Art history/Drama/Film/Art design/Perf. arts/Fine arts)",155.4514107,322,2016,1263,1263,null,null,null,"Liberal arts/Other arts and humanities2014","Liberal arts/Other arts and humanities",2014,3574]
[1418,"Arts & Humanities","PERFORMING ARTS","Arts (Music/Art history/Drama/Film/Art design/Perf. arts/Fine arts)",153.5733333,77,2016,1263,1263,null,null,null,"Liberal arts/Other arts and humanities2015","Liberal arts/Other arts and humanities",2015,3277]
[1596,"Arts & Humanities","PRACTICAL ARTS","Arts (Music/Art history/Drama/Film/Art design/Perf. arts/Fine arts)",149.7142857,7,2016,1263,1263,null,null,null,"Liberal arts/Other arts and humanities2016","Liberal arts/Other arts and humanities",2016,3446]
[1948,"Arts & Humanities","VISUAL ARTS/GRAPHICS","Arts (Music/Art history/Drama/Film/Art design/Perf. arts/Fine arts)",151.45714290000001,35,2016,1263,1263,null,null,null,"Marketing/Advertising/Real estate2002","Marketing/Advertising/Real estate",2002,1639]
[46,"Natural Sciences","AGRICULTURE","Biology/Environ. sciences/Other natural sciences",151.2890625,129,2002,3585,3585,null,null,null,"Marketing/Advertising/Real estate2003","Marketing/Advertising/Real estate",2003,2259]
[61,"Natural Sciences","AGRONOMY","Biology/Environ. sciences/Other natural sciences",153.54545450000001,11,2002,3585,3585,null,null,null,"Marketing/Advertising/Real estate2004","Marketing/Advertising/Real estate",2004,2699]
[289,"Natural Sciences","BIOLOGY, GENERAL","Biology/Environ. sciences/Other natural sciences",153.54219789999999,1653,2002,3585,3585,null,null,null,"Marketing/Advertising/Real estate2005","Marketing/Advertising/Real estate",2005,2887]
[304,"Natural Sciences","BIOLOGY, SPECIALIZATION","Biology/Environ. sciences/Other natural sciences",155.7161716,607,2002,3585,3585,null,null,null,"Marketing/Advertising/Real estate2006","Marketing/Advertising/Real estate",2006,2685]
[329,"Natural Sciences","BOTANY","Biology/Environ. sciences/Other natural sciences",155.875,16,2002,3585,3585,null,null,null,"Marketing/Advertising/Real estate2007","Marketing/Advertising/Real estate",2007,2378]
[719,"Natural Sciences","ENVIRONMENTAL SCIENCES","Biology/Environ. sciences/Other natural sciences",154.80363639999999,553,2002,3585,3585,null,null,null,"Marketing/Advertising/Real estate2008","Marketing/Advertising/Real estate",2008,2309]
[809,"Natural Sciences","FORESTRY","Biology/Environ. sciences/Other natural sciences",151.4242424,33,2002,3585,3585,null,null,null,"Marketing/Advertising/Real estate2009","Marketing/Advertising/Real estate",2009,2162]
[1251,"Natural Sciences","MARINE STUDIES","Biology/Environ. sciences/Other natural sciences",154.18518520000001,27,2002,3585,3585,null,null,null,"Marketing/Advertising/Real estate2010","Marketing/Advertising/Real estate",2010,2490]
[1356,"Natural Sciences","NATURAL SCIENCES - OTHER","Biology/Environ. sciences/Other natural sciences",153.98250730000001,345,2002,3585,3585,null,null,null,"Marketing/Advertising/Real estate2011","Marketing/Advertising/Real estate",2011,2684]
[1434,"Health Professions","PHARMACY","Biology/Environ. sciences/Other natural sciences",149.62765959999999,94,2002,3585,3585,null,null,null,"Marketing/Advertising/Real estate2012","Marketing/Advertising/Real estate",2012,2190]
[1964,"Natural Sciences","ZOOLOGY","Biology/Environ. sciences/Other natural sciences",154.3217391,117,2002,3585,3585,null,null,null,"Marketing/Advertising/Real estate2013","Marketing/Advertising/Real estate",2013,1763]
[47,"Natural Sciences","AGRICULTURE","Biology/Environ. sciences/Other natural sciences",151.37984499999999,131,2003,3915,3915,null,null,null,"Marketing/Advertising/Real estate2014","Marketing/Advertising/Real estate",2014,1452]
[62,"Natural Sciences","AGRONOMY","Biology/Environ. sciences/Other natural sciences",151.3125,16,2003,3915,3915,null,null,null,"Marketing/Advertising/Real estate2015","Marketing/Advertising/Real estate",2015,1172]
[290,"Natural Sciences","BIOLOGY, GENERAL","Biology/Environ. sciences/Other natural sciences",154.361479,1820,2003,3915,3915,null,null,null,"Marketing/Advertising/Real estate2016","Marketing/Advertising/Real estate",2016,1096]
[305,"Natural Sciences","BIOLOGY, SPECIALIZATION","Biology/Environ. sciences/Other natural sciences",156.1318373,716,2003,3915,3915,null,null,null,"Math/Physics2002","Math/Physics",2002,604]
[330,"Natural Sciences","BOTANY","Biology/Environ. sciences/Other natural sciences",155.1538462,13,2003,3915,3915,null,null,null,"Math/Physics2003","Math/Physics",2003,812]
[720,"Natural Sciences","ENVIRONMENTAL SCIENCES","Biology/Environ. sciences/Other natural sciences",155.1769616,603,2003,3915,3915,null,null,null,"Math/Physics2004","Math/Physics",2004,910]
[810,"Natural Sciences","FORESTRY","Biology/Environ. sciences/Other natural sciences",151.5,21,2003,3915,3915,null,null,null,"Math/Physics2005","Math/Physics",2005,1094]
[1252,"Natural Sciences","MARINE STUDIES","Biology/Environ. sciences/Other natural sciences",153.17241379999999,29,2003,3915,3915,null,null,null,"Math/Physics2006","Math/Physics",2006,1043]
[1357,"Natural Sciences","NATURAL SCIENCES - OTHER","Biology/Environ. sciences/Other natural sciences",155.14697409999999,347,2003,3915,3915,null,null,null,"Math/Physics2007","Math/Physics",2007,958]
[1435,"Health Professions","PHARMACY","Biology/Environ. sciences/Other natural sciences",150.9784946,95,2003,3915,3915,null,null,null,"Math/Physics2008","Math/Physics",2008,833]
[1965,"Natural Sciences","ZOOLOGY","Biology/Environ. sciences/Other natural sciences",153.89516130000001,124,2003,3915,3915,null,null,null,"Math/Physics2009","Math/Physics",2009,814]
[48,"Natural Sciences","AGRICULTURE","Biology/Environ. sciences/Other natural sciences",149.929078,142,2004,3877,3877,null,null,null,"Math/Physics2010","Math/Physics",2010,786]
[63,"Natural Sciences","AGRONOMY","Biology/Environ. sciences/Other natural sciences",151.3846154,13,2004,3877,3877,null,null,null,"Math/Physics2011","Math/Physics",2011,783]
[291,"Natural Sciences","BIOLOGY, GENERAL","Biology/Environ. sciences/Other natural sciences",154.36914290000001,1767,2004,3877,3877,null,null,null,"Math/Physics2012","Math/Physics",2012,675]
[306,"Natural Sciences","BIOLOGY, SPECIALIZATION","Biology/Environ. sciences/Other natural sciences",155.98268970000001,757,2004,3877,3877,null,null,null,"Math/Physics2013","Math/Physics",2013,594]
[331,"Natural Sciences","BOTANY","Biology/Environ. sciences/Other natural sciences",157.46666669999999,16,2004,3877,3877,null,null,null,"Math/Physics2014","Math/Physics",2014,486]
[721,"Natural Sciences","ENVIRONMENTAL SCIENCES","Biology/Environ. sciences/Other natural sciences",154.96575340000001,586,2004,3877,3877,null,null,null,"Math/Physics2015","Math/Physics",2015,453]
[811,"Natural Sciences","FORESTRY","Biology/Environ. sciences/Other natural sciences",152.54838710000001,32,2004,3877,3877,null,null,null,"Math/Physics2016","Math/Physics",2016,415]
[1253,"Natural Sciences","MARINE STUDIES","Biology/Environ. sciences/Other natural sciences",153.8823529,17,2004,3877,3877,null,null,null,"Philosophy/Religion2002","Philosophy/Religion",2002,2625]
[1358,"Natural Sciences","NATURAL SCIENCES - OTHER","Biology/Environ. sciences/Other natural sciences",154.5154062,358,2004,3877,3877,null,null,null,"Philosophy/Religion2003","Philosophy/Religion",2003,3074]
[1436,"Health Professions","PHARMACY","Biology/Environ. sciences/Other natural sciences",151.09876539999999,83,2004,3877,3877,null,null,null,"Philosophy/Religion2004","Philosophy/Religion",2004,3469]
[1966,"Natural Sciences","ZOOLOGY","Biology/Environ. sciences/Other natural sciences",154.2095238,106,2004,3877,3877,null,null,null,"Philosophy/Religion2005","Philosophy/Religion",2005,3898]
[49,"Natural Sciences","AGRICULTURE","Biology/Environ. sciences/Other natural sciences",150.24137930000001,145,2005,3725,3725,null,null,null,"Philosophy/Religion2006","Philosophy/Religion",2006,4093]
[64,"Natural Sciences","AGRONOMY","Biology/Environ. sciences/Other natural sciences",152.41176469999999,17,2005,3725,3725,null,null,null,"Philosophy/Religion2007","Philosophy/Religion",2007,4012]
[292,"Natural Sciences","BIOLOGY, GENERAL","Biology/Environ. sciences/Other natural sciences",154.23145400000001,1695,2005,3725,3725,null,null,null,"Philosophy/Religion2008","Philosophy/Religion",2008,3917]
[307,"Natural Sciences","BIOLOGY, SPECIALIZATION","Biology/Environ. sciences/Other natural sciences",156.65394739999999,762,2005,3725,3725,null,null,null,"Philosophy/Religion2009","Philosophy/Religion",2009,3834]
[332,"Natural Sciences","BOTANY","Biology/Environ. sciences/Other natural sciences",154.5,15,2005,3725,3725,null,null,null,"Philosophy/Religion2010","Philosophy/Religion",2010,4130]
[722,"Natural Sciences","ENVIRONMENTAL SCIENCES","Biology/Environ. sciences/Other natural sciences",155.51351349999999,593,2005,3725,3725,null,null,null,"Philosophy/Religion2011","Philosophy/Religion",2011,4347]
[812,"Natural Sciences","FORESTRY","Biology/Environ. sciences/Other natural sciences",152.96,25,2005,3725,3725,null,null,null,"Philosophy/Religion2012","Philosophy/Religion",2012,4004]
[1254,"Natural Sciences","MARINE STUDIES","Biology/Environ. sciences/Other natural sciences",152.173913,23,2005,3725,3725,null,null,null,"Philosophy/Religion2013","Philosophy/Religion",2013,3470]
[1359,"Natural Sciences","NATURAL SCIENCES - OTHER","Biology/Environ. sciences/Other natural sciences",155.22680410000001,294,2005,3725,3725,null,null,null,"Philosophy/Religion2014","Philosophy/Religion",2014,3135]
[1437,"Health Professions","PHARMACY","Biology/Environ. sciences/Other natural sciences",149.2028986,71,2005,3725,3725,null,null,null,"Philosophy/Religion2015","Philosophy/Religion",2015,2825]
[1967,"Natural Sciences","ZOOLOGY","Biology/Environ. sciences/Other natural sciences",154.9761905,85,2005,3725,3725,null,null,null,"Philosophy/Religion2016","Philosophy/Religion",2016,2730]
[50,"Natural Sciences","AGRICULTURE","Biology/Environ. sciences/Other natural sciences",149.19834710000001,122,2006,3385,3385,null,null,null,"Political science/Policy studies2002","Political science/Policy studies",2002,15014]
[65,"Natural Sciences","AGRONOMY","Biology/Environ. sciences/Other natural sciences",151.5,14,2006,3385,3385,null,null,null,"Political science/Policy studies2003","Political science/Policy studies",2003,16487]
[293,"Natural Sciences","BIOLOGY, GENERAL","Biology/Environ. sciences/Other natural sciences",154.7094822,1500,2006,3385,3385,null,null,null,"Political science/Policy studies2004","Political science/Policy studies",2004,18288]
[308,"Natural Sciences","BIOLOGY, SPECIALIZATION","Biology/Environ. sciences/Other natural sciences",156.4044944,715,2006,3385,3385,null,null,null,"Political science/Policy studies2005","Political science/Policy studies",2005,19261]
[333,"Natural Sciences","BOTANY","Biology/Environ. sciences/Other natural sciences",154.45454549999999,11,2006,3385,3385,null,null,null,"Political science/Policy studies2006","Political science/Policy studies",2006,19159]
[723,"Natural Sciences","ENVIRONMENTAL SCIENCES","Biology/Environ. sciences/Other natural sciences",155.10582009999999,568,2006,3385,3385,null,null,null,"Political science/Policy studies2007","Political science/Policy studies",2007,18963]
[813,"Natural Sciences","FORESTRY","Biology/Environ. sciences/Other natural sciences",151.75,28,2006,3385,3385,null,null,null,"Political science/Policy studies2008","Political science/Policy studies",2008,18467]
[1255,"Natural Sciences","MARINE STUDIES","Biology/Environ. sciences/Other natural sciences",151.52000000000001,25,2006,3385,3385,null,null,null,"Political science/Policy studies2009","Political science/Policy studies",2009,18512]
[1360,"Natural Sciences","NATURAL SCIENCES - OTHER","Biology/Environ. sciences/Other natural sciences",154.47983869999999,251,2006,3385,3385,null,null,null,"Political science/Policy studies2010","Political science/Policy studies",2010,19017]
[1438,"Health Professions","PHARMACY","Biology/Environ. sciences/Other natural sciences",151.9848485,66,2006,3385,{"$f":"VLOOKUP(D386&G386,$M$2:$P$436,4)","v":3385},null,null,null,"Political science/Policy studies2011","Political science/Policy studies",2011,19374]
[1968,"Natural Sciences","ZOOLOGY","Biology/Environ. sciences/Other natural sciences",155.70588240000001,85,2006,3385,3385,null,null,null,{"$f":"CONCATENATE(N387,O387)","v":"Political science/Policy studies2012"},"Political science/Policy studies",2012,17658]
[51,"Natural Sciences","AGRICULTURE","Biology/Environ. sciences/Other natural sciences",151.68468469999999,112,2007,2943,2943,null,null,null,"Political science/Policy studies2013","Political science/Policy studies",2013,15952]
[66,"Natural Sciences","AGRONOMY","Biology/Environ. sciences/Other natural sciences",144.30000000000001,10,2007,2943,2943,null,null,null,"Political science/Policy studies2014","Political science/Policy studies",2014,14310]
[294,"Natural Sciences","BIOLOGY, GENERAL","Biology/Environ. sciences/Other natural sciences",154.5128205,1301,2007,2943,2943,null,null,null,"Political science/Policy studies2015","Political science/Policy studies",2015,13557]
[309,"Natural Sciences","BIOLOGY, SPECIALIZATION","Biology/Environ. sciences/Other natural sciences",157.31914889999999,614,2007,2943,2943,null,null,null,"Political science/Policy studies2016","Political science/Policy studies",2016,12968]
[334,"Natural Sciences","BOTANY","Biology/Environ. sciences/Other natural sciences",156.11111109999999,9,2007,2943,2943,null,null,null,"Psychology2002","Psychology",2002,5343]
[724,"Natural Sciences","ENVIRONMENTAL SCIENCES","Biology/Environ. sciences/Other natural sciences",155.72709549999999,515,2007,2943,2943,null,null,null,"Psychology2003","Psychology",2003,6113]
[814,"Natural Sciences","FORESTRY","Biology/Environ. sciences/Other natural sciences",152.5909091,23,2007,2943,2943,null,null,null,"Psychology2004","Psychology",2004,6486]
[1256,"Natural Sciences","MARINE STUDIES","Biology/Environ. sciences/Other natural sciences",154.15789470000001,19,2007,2943,2943,null,null,null,"Psychology2005","Psychology",2005,6569]
[1361,"Natural Sciences","NATURAL SCIENCES - OTHER","Biology/Environ. sciences/Other natural sciences",153.14146339999999,205,2007,2943,2943,null,null,null,"Psychology2006","Psychology",2006,6307]
[1439,"Health Professions","PHARMACY","Biology/Environ. sciences/Other natural sciences",151.43283579999999,67,2007,2943,2943,null,null,null,"Psychology2007","Psychology",2007,5933]
[1969,"Natural Sciences","ZOOLOGY","Biology/Environ. sciences/Other natural sciences",154.83582089999999,68,2007,2943,2943,null,null,null,"Psychology2008","Psychology",2008,5645]
[52,"Natural Sciences","AGRICULTURE","Biology/Environ. sciences/Other natural sciences",151.42857140000001,92,2008,2729,2729,null,null,null,"Psychology2009","Psychology",2009,5635]
[67,"Natural Sciences","AGRONOMY","Biology/Environ. sciences/Other natural sciences",150.14285709999999,14,2008,2729,2729,null,null,null,"Psychology2010","Psychology",2010,5674]
[295,"Natural Sciences","BIOLOGY, GENERAL","Biology/Environ. sciences/Other natural sciences",155.1093621,1212,2008,2729,2729,null,null,null,"Psychology2011","Psychology",2011,5673]
[310,"Natural Sciences","BIOLOGY, SPECIALIZATION","Biology/Environ. sciences/Other natural sciences",157.04278070000001,562,2008,2729,2729,null,null,null,"Psychology2012","Psychology",2012,4999]
[335,"Natural Sciences","BOTANY","Biology/Environ. sciences/Other natural sciences",156.88888890000001,9,2008,2729,2729,null,null,null,"Psychology2013","Psychology",2013,4649]
[725,"Natural Sciences","ENVIRONMENTAL SCIENCES","Biology/Environ. sciences/Other natural sciences",156.4976959,435,2008,2729,2729,null,null,null,"Psychology2014","Psychology",2014,4086]
[815,"Natural Sciences","FORESTRY","Biology/Environ. sciences/Other natural sciences",152.65217390000001,23,2008,2729,2729,null,null,null,"Psychology2015","Psychology",2015,3772]
[1257,"Natural Sciences","MARINE STUDIES","Biology/Environ. sciences/Other natural sciences",155.05263160000001,20,2008,2729,2729,null,null,null,"Psychology2016","Psychology",2016,3778]
[1362,"Natural Sciences","NATURAL SCIENCES - OTHER","Biology/Environ. sciences/Other natural sciences",155.26956519999999,232,2008,2729,2729,null,null,null,"Social Sciences-Other2002","Social Sciences-Other",2002,1535]
[1440,"Health Professions","PHARMACY","Biology/Environ. sciences/Other natural sciences",151.60655740000001,62,2008,2729,2729,null,null,null,"Social Sciences-Other2003","Social Sciences-Other",2003,1717]
[1970,"Natural Sciences","ZOOLOGY","Biology/Environ. sciences/Other natural sciences",155.7230769,68,2008,2729,2729,null,null,null,"Social Sciences-Other2004","Social Sciences-Other",2004,1568]
[53,"Natural Sciences","AGRICULTURE","Biology/Environ. sciences/Other natural sciences",151.5789474,96,2009,2630,2630,null,null,null,"Social Sciences-Other2005","Social Sciences-Other",2005,1356]
[68,"Natural Sciences","AGRONOMY","Biology/Environ. sciences/Other natural sciences",152.4,10,2009,2630,2630,null,null,null,"Social Sciences-Other2006","Social Sciences-Other",2006,1243]
[296,"Natural Sciences","BIOLOGY, GENERAL","Biology/Environ. sciences/Other natural sciences",155.10944029999999,1201,2009,2630,2630,null,null,null,"Social Sciences-Other2007","Social Sciences-Other",2007,1127]
[311,"Natural Sciences","BIOLOGY, SPECIALIZATION","Biology/Environ. sciences/Other natural sciences",157.24448530000001,546,2009,2630,2630,null,null,null,"Social Sciences-Other2008","Social Sciences-Other",2008,1083]
[336,"Natural Sciences","BOTANY","Biology/Environ. sciences/Other natural sciences",152.9,10,2009,2630,2630,null,null,null,"Social Sciences-Other2009","Social Sciences-Other",2009,1081]
[726,"Natural Sciences","ENVIRONMENTAL SCIENCES","Biology/Environ. sciences/Other natural sciences",156.10681819999999,440,2009,2630,2630,null,null,null,"Social Sciences-Other2010","Social Sciences-Other",2010,1108]
[816,"Natural Sciences","FORESTRY","Biology/Environ. sciences/Other natural sciences",155.3846154,13,2009,2630,2630,null,null,null,"Social Sciences-Other2011","Social Sciences-Other",2011,1049]
[1258,"Natural Sciences","MARINE STUDIES","Biology/Environ. sciences/Other natural sciences",154.2666667,15,2009,2630,2630,null,null,null,"Social Sciences-Other2012","Social Sciences-Other",2012,910]
[1363,"Natural Sciences","NATURAL SCIENCES - OTHER","Biology/Environ. sciences/Other natural sciences",155.65625,194,2009,2630,2630,null,null,null,"Social Sciences-Other2013","Social Sciences-Other",2013,799]
[1441,"Health Professions","PHARMACY","Biology/Environ. sciences/Other natural sciences",151.33333329999999,52,2009,2630,2630,null,null,null,"Social Sciences-Other2014","Social Sciences-Other",2014,676]
[1971,"Natural Sciences","ZOOLOGY","Biology/Environ. sciences/Other natural sciences",154.07547170000001,53,2009,2630,2630,null,null,null,"Social Sciences-Other2015","Social Sciences-Other",2015,652]
[54,"Natural Sciences","AGRICULTURE","Biology/Environ. sciences/Other natural sciences",152.12745100000001,102,2010,2779,2779,null,null,null,"Social Sciences-Other2016","Social Sciences-Other",2016,631]
[69,"Natural Sciences","AGRONOMY","Biology/Environ. sciences/Other natural sciences",155.2857143,14,2010,2779,2779,null,null,null,"Sociology/Social work/Urban studies/Women's studies2002","Sociology/Social work/Urban studies/Women's studies",2002,3690]
[297,"Natural Sciences","BIOLOGY, GENERAL","Biology/Environ. sciences/Other natural sciences",155.42394820000001,1248,2010,2779,2779,null,null,null,"Sociology/Social work/Urban studies/Women's studies2003","Sociology/Social work/Urban studies/Women's studies",2003,3850]
[312,"Natural Sciences","BIOLOGY, SPECIALIZATION","Biology/Environ. sciences/Other natural sciences",157.44918029999999,610,2010,2779,2779,null,null,null,"Sociology/Social work/Urban studies/Women's studies2004","Sociology/Social work/Urban studies/Women's studies",2004,4086]
[337,"Natural Sciences","BOTANY","Biology/Environ. sciences/Other natural sciences",146.83333329999999,6,2010,2779,2779,null,null,null,"Sociology/Social work/Urban studies/Women's studies2005","Sociology/Social work/Urban studies/Women's studies",2005,4115]
[727,"Natural Sciences","ENVIRONMENTAL SCIENCES","Biology/Environ. sciences/Other natural sciences",157.06443909999999,421,2010,2779,2779,null,null,null,"Sociology/Social work/Urban studies/Women's studies2006","Sociology/Social work/Urban studies/Women's studies",2006,3958]
[817,"Natural Sciences","FORESTRY","Biology/Environ. sciences/Other natural sciences",152.54545450000001,11,2010,2779,2779,null,null,null,"Sociology/Social work/Urban studies/Women's studies2007","Sociology/Social work/Urban studies/Women's studies",2007,3852]
[1259,"Natural Sciences","MARINE STUDIES","Biology/Environ. sciences/Other natural sciences",153.7222222,18,2010,2779,2779,null,null,null,"Sociology/Social work/Urban studies/Women's studies2008","Sociology/Social work/Urban studies/Women's studies",2008,3678]
[1364,"Natural Sciences","NATURAL SCIENCES - OTHER","Biology/Environ. sciences/Other natural sciences",155.64135020000001,239,2010,2779,2779,null,null,null,"Sociology/Social work/Urban studies/Women's studies2009","Sociology/Social work/Urban studies/Women's studies",2009,3561]
[1442,"Health Professions","PHARMACY","Biology/Environ. sciences/Other natural sciences",151.40677969999999,61,2010,2779,2779,null,null,null,"Sociology/Social work/Urban studies/Women's studies2010","Sociology/Social work/Urban studies/Women's studies",2010,3643]
[1972,"Natural Sciences","ZOOLOGY","Biology/Environ. sciences/Other natural sciences",154.1836735,49,2010,2779,2779,null,null,null,"Sociology/Social work/Urban studies/Women's studies2011","Sociology/Social work/Urban studies/Women's studies",2011,3584]
[55,"Natural Sciences","AGRICULTURE","Biology/Environ. sciences/Other natural sciences",150.30120479999999,83,2011,2724,2724,null,null,null,"Sociology/Social work/Urban studies/Women's studies2012","Sociology/Social work/Urban studies/Women's studies",2012,3380]
[298,"Natural Sciences","BIOLOGY, GENERAL","Biology/Environ. sciences/Other natural sciences",155.43781089999999,1219,2011,2724,2724,null,null,null,"Sociology/Social work/Urban studies/Women's studies2013","Sociology/Social work/Urban studies/Women's studies",2013,3125]
[313,"Natural Sciences","BIOLOGY, SPECIALIZATION","Biology/Environ. sciences/Other natural sciences",158.06065860000001,579,2011,2724,2724,null,null,null,"Sociology/Social work/Urban studies/Women's studies2014","Sociology/Social work/Urban studies/Women's studies",2014,2756]
[338,"Natural Sciences","BOTANY","Biology/Environ. sciences/Other natural sciences",152.57142859999999,7,2011,2724,2724,null,null,null,"Sociology/Social work/Urban studies/Women's studies2015","Sociology/Social work/Urban studies/Women's studies",2015,2583]
[728,"Natural Sciences","ENVIRONMENTAL SCIENCES","Biology/Environ. sciences/Other natural sciences",157.04914529999999,470,2011,2724,2724,null,null,null,"Sociology/Social work/Urban studies/Women's studies2016","Sociology/Social work/Urban studies/Women's studies",2016,2601]
[818,"Natural Sciences","FORESTRY","Biology/Environ. sciences/Other natural sciences",156.8823529,17,2011,2724,2724]
[1260,"Natural Sciences","MARINE STUDIES","Biology/Environ. sciences/Other natural sciences",154.67857140000001,28,2011,2724,2724]
[1365,"Natural Sciences","NATURAL SCIENCES - OTHER","Biology/Environ. sciences/Other natural sciences",154.27555559999999,227,2011,2724,2724]
[1443,"Health Professions","PHARMACY","Biology/Environ. sciences/Other natural sciences",151.4107143,56,2011,2724,2724]
[1973,"Natural Sciences","ZOOLOGY","Biology/Environ. sciences/Other natural sciences",154.78378380000001,38,2011,2724,2724]
[56,"Natural Sciences","AGRICULTURE","Biology/Environ. sciences/Other natural sciences",151.08421050000001,95,2012,2498,2498]
[70,"Natural Sciences","AGRONOMY","Biology/Environ. sciences/Other natural sciences",152.19999999999999,5,2012,2498,2498]
[299,"Natural Sciences","BIOLOGY, GENERAL","Biology/Environ. sciences/Other natural sciences",155.09954339999999,1101,2012,2498,2498]
[314,"Natural Sciences","BIOLOGY, SPECIALIZATION","Biology/Environ. sciences/Other natural sciences",157.5432596,499,2012,2498,2498]
[339,"Natural Sciences","BOTANY","Biology/Environ. sciences/Other natural sciences",147.66666670000001,6,2012,2498,2498]
[729,"Natural Sciences","ENVIRONMENTAL SCIENCES","Biology/Environ. sciences/Other natural sciences",157.90497740000001,442,2012,2498,2498]
[819,"Natural Sciences","FORESTRY","Biology/Environ. sciences/Other natural sciences",160.2777778,18,2012,2498,2498]
[1261,"Natural Sciences","MARINE STUDIES","Biology/Environ. sciences/Other natural sciences",156.42307690000001,26,2012,2498,2498]
[1366,"Natural Sciences","NATURAL SCIENCES - OTHER","Biology/Environ. sciences/Other natural sciences",155.46113990000001,195,2012,2498,{"$f":"VLOOKUP(D450&G450,$M$2:$P$436,4)","v":2498}]
[1444,"Health Professions","PHARMACY","Biology/Environ. sciences/Other natural sciences",153.12068970000001,61,2012,2498,2498]
[1974,"Natural Sciences","ZOOLOGY","Biology/Environ. sciences/Other natural sciences",154.66,50,2012,2498,2498]
[57,"Natural Sciences","AGRICULTURE","Biology/Environ. sciences/Other natural sciences",151.12121210000001,99,2013,2180,2180]
[300,"Natural Sciences","BIOLOGY, GENERAL","Biology/Environ. sciences/Other natural sciences",154.04081629999999,939,2013,2180,2180]
[315,"Natural Sciences","BIOLOGY, SPECIALIZATION","Biology/Environ. sciences/Other natural sciences",157.36386139999999,408,2013,2180,2180]
[340,"Natural Sciences","BOTANY","Biology/Environ. sciences/Other natural sciences",162,7,2013,2180,2180]
[730,"Natural Sciences","ENVIRONMENTAL SCIENCES","Biology/Environ. sciences/Other natural sciences",158.08965520000001,438,2013,2180,2180]
[820,"Natural Sciences","FORESTRY","Biology/Environ. sciences/Other natural sciences",148.9,10,2013,2180,2180]
[1262,"Natural Sciences","MARINE STUDIES","Biology/Environ. sciences/Other natural sciences",154.85,20,2013,2180,2180]
[1367,"Natural Sciences","NATURAL SCIENCES - OTHER","Biology/Environ. sciences/Other natural sciences",153.65868259999999,169,2013,2180,2180]
[1445,"Health Professions","PHARMACY","Biology/Environ. sciences/Other natural sciences",151.5625,49,2013,2180,2180]
[1975,"Natural Sciences","ZOOLOGY","Biology/Environ. sciences/Other natural sciences",154.34146340000001,41,2013,2180,2180]
[58,"Natural Sciences","AGRICULTURE","Biology/Environ. sciences/Other natural sciences",150.61038959999999,78,2014,1910,1910]
[301,"Natural Sciences","BIOLOGY, GENERAL","Biology/Environ. sciences/Other natural sciences",153.29100529999999,773,2014,1910,1910]
[316,"Natural Sciences","BIOLOGY, SPECIALIZATION","Biology/Environ. sciences/Other natural sciences",157.38611109999999,366,2014,1910,1910]
[341,"Natural Sciences","BOTANY","Biology/Environ. sciences/Other natural sciences",155.83333329999999,6,2014,1910,1910]
[731,"Natural Sciences","ENVIRONMENTAL SCIENCES","Biology/Environ. sciences/Other natural sciences",156.32668330000001,408,2014,1910,1910]
[821,"Natural Sciences","FORESTRY","Biology/Environ. sciences/Other natural sciences",156.66666670000001,9,2014,1910,1910]
[1263,"Natural Sciences","MARINE STUDIES","Biology/Environ. sciences/Other natural sciences",153,13,2014,1910,1910]
[1368,"Natural Sciences","NATURAL SCIENCES - OTHER","Biology/Environ. sciences/Other natural sciences",152.55294119999999,171,2014,1910,1910]
[1446,"Health Professions","PHARMACY","Biology/Environ. sciences/Other natural sciences",149.0188679,55,2014,1910,1910]
[1976,"Natural Sciences","ZOOLOGY","Biology/Environ. sciences/Other natural sciences",152.03333330000001,31,2014,1910,1910]
[59,"Natural Sciences","AGRICULTURE","Biology/Environ. sciences/Other natural sciences",152.453125,65,2015,1787,1787]
[71,"Natural Sciences","AGRONOMY","Biology/Environ. sciences/Other natural sciences",151.83333329999999,6,2015,1787,1787]
[302,"Natural Sciences","BIOLOGY, GENERAL","Biology/Environ. sciences/Other natural sciences",153.51051889999999,730,2015,1787,1787]
[317,"Natural Sciences","BIOLOGY, SPECIALIZATION","Biology/Environ. sciences/Other natural sciences",157.568254,323,2015,1787,1787]
[342,"Natural Sciences","BOTANY","Biology/Environ. sciences/Other natural sciences",149.16666670000001,6,2015,1787,1787]
[732,"Natural Sciences","ENVIRONMENTAL SCIENCES","Biology/Environ. sciences/Other natural sciences",157.27272730000001,399,2015,1787,1787]
[822,"Natural Sciences","FORESTRY","Biology/Environ. sciences/Other natural sciences",154.19999999999999,6,2015,1787,1787]
[1264,"Natural Sciences","MARINE STUDIES","Biology/Environ. sciences/Other natural sciences",155.4,20,2015,1787,1787]
[1369,"Natural Sciences","NATURAL SCIENCES - OTHER","Biology/Environ. sciences/Other natural sciences",153.8830409,172,2015,1787,1787]
[1447,"Health Professions","PHARMACY","Biology/Environ. sciences/Other natural sciences",150.13513510000001,37,2015,1787,1787]
[1977,"Natural Sciences","ZOOLOGY","Biology/Environ. sciences/Other natural sciences",154.31818179999999,23,2015,1787,1787]
[60,"Natural Sciences","AGRICULTURE","Biology/Environ. sciences/Other natural sciences",151.44318179999999,89,2016,1831,1831]
[303,"Natural Sciences","BIOLOGY, GENERAL","Biology/Environ. sciences/Other natural sciences",153.75619829999999,744,2016,1831,1831]
[318,"Natural Sciences","BIOLOGY, SPECIALIZATION","Biology/Environ. sciences/Other natural sciences",157.8356546,371,2016,1831,1831]
[343,"Natural Sciences","BOTANY","Biology/Environ. sciences/Other natural sciences",151,5,2016,1831,1831]
[733,"Natural Sciences","ENVIRONMENTAL SCIENCES","Biology/Environ. sciences/Other natural sciences",156.46575340000001,366,2016,1831,1831]
[823,"Natural Sciences","FORESTRY","Biology/Environ. sciences/Other natural sciences",154.125,8,2016,1831,1831]
[1265,"Natural Sciences","MARINE STUDIES","Biology/Environ. sciences/Other natural sciences",159.14285709999999,14,2016,1831,1831]
[1370,"Natural Sciences","NATURAL SCIENCES - OTHER","Biology/Environ. sciences/Other natural sciences",153.4852071,171,2016,1831,1831]
[1448,"Health Professions","PHARMACY","Biology/Environ. sciences/Other natural sciences",149.29268289999999,41,2016,1831,1831]
[1978,"Natural Sciences","ZOOLOGY","Biology/Environ. sciences/Other natural sciences",152.77272730000001,22,2016,1831,1831]
[344,"Business & Management","BUSINESS ADMINISTRATION","Business administration/Business education",148.7603604,2243,2002,2424,2424]
[360,"Business & Management","BUSINESS AND COMMERCE, GENERAL","Business administration/Business education",151.50335569999999,150,2002,2424,2424]
[389,"Business & Management","BUSINESS EDUCATION","Business administration/Business education",145.5357143,31,2002,2424,2424]
[345,"Business & Management","BUSINESS ADMINISTRATION","Business administration/Business education",149.6364629,2778,2003,2998,2998]
[361,"Business & Management","BUSINESS AND COMMERCE, GENERAL","Business administration/Business education",152.5343915,191,2003,2998,2998]
[390,"Business & Management","BUSINESS EDUCATION","Business administration/Business education",142.7142857,29,2003,2998,2998]
[346,"Business & Management","BUSINESS ADMINISTRATION","Business administration/Business education",149.93370530000001,3076,2004,3316,3316]
[362,"Business & Management","BUSINESS AND COMMERCE, GENERAL","Business administration/Business education",151.4579439,214,2004,3316,3316]
[391,"Business & Management","BUSINESS EDUCATION","Business administration/Business education",146.7692308,26,2004,3316,3316]
[347,"Business & Management","BUSINESS ADMINISTRATION","Business administration/Business education",150.44946719999999,3123,2005,3392,3392]
[363,"Business & Management","BUSINESS AND COMMERCE, GENERAL","Business administration/Business education",152.57021280000001,236,2005,3392,3392]
[392,"Business & Management","BUSINESS EDUCATION","Business administration/Business education",147.72727269999999,33,2005,3392,3392]
[348,"Business & Management","BUSINESS ADMINISTRATION","Business administration/Business education",150.37292819999999,2926,2006,3174,3174]
[364,"Business & Management","BUSINESS AND COMMERCE, GENERAL","Business administration/Business education",152.629108,215,2006,3174,3174]
[393,"Business & Management","BUSINESS EDUCATION","Business administration/Business education",147.8064516,33,2006,3174,3174]
[349,"Business & Management","BUSINESS ADMINISTRATION","Business administration/Business education",149.9914029,2589,2007,2816,2816]
[365,"Business & Management","BUSINESS AND COMMERCE, GENERAL","Business administration/Business education",152.94949489999999,199,2007,2816,2816]
[394,"Business & Management","BUSINESS EDUCATION","Business administration/Business education",145.64285709999999,28,2007,2816,2816]
[350,"Business & Management","BUSINESS ADMINISTRATION","Business administration/Business education",150.16028710000001,2536,2008,2707,2707]
[366,"Business & Management","BUSINESS AND COMMERCE, GENERAL","Business administration/Business education",152.57792209999999,154,2008,2707,2707]
[395,"Business & Management","BUSINESS EDUCATION","Business administration/Business education",147.8823529,17,2008,2707,{"$f":"VLOOKUP(D514&G514,$M$2:$P$436,4)","v":2707}]
[351,"Business & Management","BUSINESS ADMINISTRATION","Business administration/Business education",149.85237699999999,2428,2009,2612,2612]
[367,"Business & Management","BUSINESS AND COMMERCE, GENERAL","Business administration/Business education",152.4814815,163,2009,2612,2612]
[396,"Business & Management","BUSINESS EDUCATION","Business administration/Business education",147.42857140000001,21,2009,2612,2612]
[352,"Business & Management","BUSINESS ADMINISTRATION","Business administration/Business education",150.3316485,2603,2010,2794,2794]
[368,"Business & Management","BUSINESS AND COMMERCE, GENERAL","Business administration/Business education",152.55089820000001,167,2010,2794,2794]
[397,"Business & Management","BUSINESS EDUCATION","Business administration/Business education",152.13043479999999,24,2010,2794,2794]
[353,"Business & Management","BUSINESS ADMINISTRATION","Business administration/Business education",150.8774263,2804,2011,3046,3046]
[369,"Business & Management","BUSINESS AND COMMERCE, GENERAL","Business administration/Business education",153.91089109999999,202,2011,3046,3046]
[398,"Business & Management","BUSINESS EDUCATION","Business administration/Business education",147.875,40,2011,3046,3046]
[354,"Business & Management","BUSINESS ADMINISTRATION","Business administration/Business education",150.83095800000001,2550,2012,2764,2764]
[370,"Business & Management","BUSINESS AND COMMERCE, GENERAL","Business administration/Business education",153.83908049999999,176,2012,2764,2764]
[399,"Business & Management","BUSINESS EDUCATION","Business administration/Business education",148.91891889999999,38,2012,2764,2764]
[355,"Business & Management","BUSINESS ADMINISTRATION","Business administration/Business education",150.28406910000001,2115,2013,2275,2275]
[371,"Business & Management","BUSINESS AND COMMERCE, GENERAL","Business administration/Business education",152.34848479999999,133,2013,2275,2275]
[400,"Business & Management","BUSINESS EDUCATION","Business administration/Business education",145.85185190000001,27,2013,2275,2275]
[356,"Business & Management","BUSINESS ADMINISTRATION","Business administration/Business education",149.3126714,1861,2014,2027,2027]
[372,"Business & Management","BUSINESS AND COMMERCE, GENERAL","Business administration/Business education",151.8540146,137,2014,2027,2027]
[401,"Business & Management","BUSINESS EDUCATION","Business administration/Business education",146.51724139999999,29,2014,2027,2027]
[357,"Business & Management","BUSINESS ADMINISTRATION","Business administration/Business education",149.62721519999999,1625,2015,1760,1760]
[373,"Business & Management","BUSINESS AND COMMERCE, GENERAL","Business administration/Business education",152.24299070000001,113,2015,1760,1760]
[402,"Business & Management","BUSINESS EDUCATION","Business administration/Business education",147.42857140000001,22,2015,1760,1760]
[358,"Business & Management","BUSINESS ADMINISTRATION","Business administration/Business education",148.72152729999999,1554,2016,1707,1707]
[359,"Business & Management","BUSINESS AND COMMERCE, GENERAL","Business administration/Business education",152.1417323,129,2016,1707,1707]
[403,"Business & Management","BUSINESS EDUCATION","Business administration/Business education",150.20833329999999,24,2016,1707,1707]
[249,"Natural Sciences","AVIATION SCIENCE","Business mgmt./Intl. bus./Public affairs/Hotel & rest. mgmt.",150.33333329999999,15,2002,3934,3934]
[374,"Business & Management","BUSINESS AND MANAGEMENT - OTHER","Business mgmt./Intl. bus./Public affairs/Hotel & rest. mgmt.",150.2680412,587,2002,3934,3934]
[404,"Business & Management","BUSINESS MANAGEMENT","Business mgmt./Intl. bus./Public affairs/Hotel & rest. mgmt.",148.8367609,1573,2002,3934,3934]
[419,"Business & Management","BUSINESS MANAGEMENT/ADMINISTRATION","Business mgmt./Intl. bus./Public affairs/Hotel & rest. mgmt.",147.48373100000001,468,2002,3934,3934]
[991,"Business & Management","HOTEL/RESTAURANT MANAGEMENT","Business mgmt./Intl. bus./Public affairs/Hotel & rest. mgmt.",149.43442619999999,124,2002,3934,3934]
[1021,"Business & Management","INDUSTRIAL MANAGEMENT","Business mgmt./Intl. bus./Public affairs/Hotel & rest. mgmt.",147.49019609999999,51,2002,3934,3934]
[1036,"Business & Management","INDUSTRIAL RELATIONS","Business mgmt./Intl. bus./Public affairs/Hotel & rest. mgmt.",155.875,121,2002,3934,3934]
[1124,"Business & Management","INTERNATIONAL BUSINESS","Business mgmt./Intl. bus./Public affairs/Hotel & rest. mgmt.",151.0098619,509,2002,3934,3934]
[1326,"Social Sciences & Helping Professions","MILITARY SCIENCE","Business mgmt./Intl. bus./Public affairs/Hotel & rest. mgmt.",149.7142857,7,2002,3934,3934]
[1419,"Business & Management","PERSONNEL MANAGEMENT","Business mgmt./Intl. bus./Public affairs/Hotel & rest. mgmt.",146.25949370000001,159,2002,3934,3934]
[1641,"Social Sciences & Helping Professions","PUBLIC AFFAIRS/SERVICES/ADMIN","Business mgmt./Intl. bus./Public affairs/Hotel & rest. mgmt.",149.04285709999999,285,2002,3934,3934]
[1904,"Business & Management","TRANSPORTATION AND COMMERCE","Business mgmt./Intl. bus./Public affairs/Hotel & rest. mgmt.",151.08571430000001,35,2002,3934,3934]
[250,"Natural Sciences","AVIATION SCIENCE","Business mgmt./Intl. bus./Public affairs/Hotel & rest. mgmt.",153.07142859999999,14,2003,5018,5018]
[375,"Business & Management","BUSINESS AND MANAGEMENT - OTHER","Business mgmt./Intl. bus./Public affairs/Hotel & rest. mgmt.",151.18210859999999,946,2003,5018,5018]
[405,"Business & Management","BUSINESS MANAGEMENT","Business mgmt./Intl. bus./Public affairs/Hotel & rest. mgmt.",149.09728029999999,1927,2003,5018,5018]
[420,"Business & Management","BUSINESS MANAGEMENT/ADMINISTRATION","Business mgmt./Intl. bus./Public affairs/Hotel & rest. mgmt.",147.92321430000001,568,2003,5018,5018]
[992,"Business & Management","HOTEL/RESTAURANT MANAGEMENT","Business mgmt./Intl. bus./Public affairs/Hotel & rest. mgmt.",149.70676689999999,136,2003,5018,5018]
[1022,"Business & Management","INDUSTRIAL MANAGEMENT","Business mgmt./Intl. bus./Public affairs/Hotel & rest. mgmt.",147.60317459999999,64,2003,5018,5018]
[1037,"Business & Management","INDUSTRIAL RELATIONS","Business mgmt./Intl. bus./Public affairs/Hotel & rest. mgmt.",155.86486489999999,112,2003,5018,5018]
[1125,"Business & Management","INTERNATIONAL BUSINESS","Business mgmt./Intl. bus./Public affairs/Hotel & rest. mgmt.",151.64830509999999,712,2003,5018,5018]
[1327,"Social Sciences & Helping Professions","MILITARY SCIENCE","Business mgmt./Intl. bus./Public affairs/Hotel & rest. mgmt.",150.625,8,2003,5018,5018]
[1420,"Business & Management","PERSONNEL MANAGEMENT","Business mgmt./Intl. bus./Public affairs/Hotel & rest. mgmt.",146.96491230000001,173,2003,5018,5018]
[1642,"Social Sciences & Helping Professions","PUBLIC AFFAIRS/SERVICES/ADMIN","Business mgmt./Intl. bus./Public affairs/Hotel & rest. mgmt.",148.6283784,302,2003,5018,5018]
[1905,"Business & Management","TRANSPORTATION AND COMMERCE","Business mgmt./Intl. bus./Public affairs/Hotel & rest. mgmt.",149.125,56,2003,5018,5018]
[251,"Natural Sciences","AVIATION SCIENCE","Business mgmt./Intl. bus./Public affairs/Hotel & rest. mgmt.",149.80000000000001,22,2004,5539,5539]
[376,"Business & Management","BUSINESS AND MANAGEMENT - OTHER","Business mgmt./Intl. bus./Public affairs/Hotel & rest. mgmt.",152.1789737,803,2004,5539,5539]
[406,"Business & Management","BUSINESS MANAGEMENT","Business mgmt./Intl. bus./Public affairs/Hotel & rest. mgmt.",149.6328565,2332,2004,5539,5539]
[421,"Business & Management","BUSINESS MANAGEMENT/ADMINISTRATION","Business mgmt./Intl. bus./Public affairs/Hotel & rest. mgmt.",148.3469388,688,2004,5539,5539]
[993,"Business & Management","HOTEL/RESTAURANT MANAGEMENT","Business mgmt./Intl. bus./Public affairs/Hotel & rest. mgmt.",150.208,126,2004,5539,5539]
[1023,"Business & Management","INDUSTRIAL MANAGEMENT","Business mgmt./Intl. bus./Public affairs/Hotel & rest. mgmt.",149.8833333,61,2004,5539,5539]
[1038,"Business & Management","INDUSTRIAL RELATIONS","Business mgmt./Intl. bus./Public affairs/Hotel & rest. mgmt.",155.9082569,110,2004,5539,5539]
[1126,"Business & Management","INTERNATIONAL BUSINESS","Business mgmt./Intl. bus./Public affairs/Hotel & rest. mgmt.",151.84963329999999,823,2004,5539,5539]
[1328,"Social Sciences & Helping Professions","MILITARY SCIENCE","Business mgmt./Intl. bus./Public affairs/Hotel & rest. mgmt.",150.125,16,2004,5539,5539]
[1421,"Business & Management","PERSONNEL MANAGEMENT","Business mgmt./Intl. bus./Public affairs/Hotel & rest. mgmt.",148.25595240000001,170,2004,5539,5539]
[1643,"Social Sciences & Helping Professions","PUBLIC AFFAIRS/SERVICES/ADMIN","Business mgmt./Intl. bus./Public affairs/Hotel & rest. mgmt.",149.3448276,326,2004,5539,5539]
[1906,"Business & Management","TRANSPORTATION AND COMMERCE","Business mgmt./Intl. bus./Public affairs/Hotel & rest. mgmt.",152.14516130000001,62,2004,5539,5539]
[252,"Natural Sciences","AVIATION SCIENCE","Business mgmt./Intl. bus./Public affairs/Hotel & rest. mgmt.",151,11,2005,5855,5855]
[377,"Business & Management","BUSINESS AND MANAGEMENT - OTHER","Business mgmt./Intl. bus./Public affairs/Hotel & rest. mgmt.",152.26216640000001,641,2005,5855,5855]
[407,"Business & Management","BUSINESS MANAGEMENT","Business mgmt./Intl. bus./Public affairs/Hotel & rest. mgmt.",150.0574981,2594,2005,5855,5855]
[422,"Business & Management","BUSINESS MANAGEMENT/ADMINISTRATION","Business mgmt./Intl. bus./Public affairs/Hotel & rest. mgmt.",149.02325579999999,788,2005,5855,{"$f":"VLOOKUP(D578&G578,$M$2:$P$436,4)","v":5855}]
[994,"Business & Management","HOTEL/RESTAURANT MANAGEMENT","Business mgmt./Intl. bus./Public affairs/Hotel & rest. mgmt.",151.7578125,130,2005,5855,5855]
[1024,"Business & Management","INDUSTRIAL MANAGEMENT","Business mgmt./Intl. bus./Public affairs/Hotel & rest. mgmt.",150.9107143,56,2005,5855,5855]
[1039,"Business & Management","INDUSTRIAL RELATIONS","Business mgmt./Intl. bus./Public affairs/Hotel & rest. mgmt.",156.5,134,2005,5855,5855]
[1127,"Business & Management","INTERNATIONAL BUSINESS","Business mgmt./Intl. bus./Public affairs/Hotel & rest. mgmt.",151.81808280000001,924,2005,5855,5855]
[1329,"Social Sciences & Helping Professions","MILITARY SCIENCE","Business mgmt./Intl. bus./Public affairs/Hotel & rest. mgmt.",148,13,2005,5855,5855]
[1422,"Business & Management","PERSONNEL MANAGEMENT","Business mgmt./Intl. bus./Public affairs/Hotel & rest. mgmt.",147.72588830000001,198,2005,5855,5855]
[1644,"Social Sciences & Helping Professions","PUBLIC AFFAIRS/SERVICES/ADMIN","Business mgmt./Intl. bus./Public affairs/Hotel & rest. mgmt.",149.52525249999999,300,2005,5855,5855]
[1907,"Business & Management","TRANSPORTATION AND COMMERCE","Business mgmt./Intl. bus./Public affairs/Hotel & rest. mgmt.",152.5,66,2005,5855,5855]
[253,"Natural Sciences","AVIATION SCIENCE","Business mgmt./Intl. bus./Public affairs/Hotel & rest. mgmt.",150.81818179999999,11,2006,5482,5482]
[378,"Business & Management","BUSINESS AND MANAGEMENT - OTHER","Business mgmt./Intl. bus./Public affairs/Hotel & rest. mgmt.",152.6074074,542,2006,5482,5482]
[408,"Business & Management","BUSINESS MANAGEMENT","Business mgmt./Intl. bus./Public affairs/Hotel & rest. mgmt.",150.26916800000001,2476,2006,5482,5482]
[423,"Business & Management","BUSINESS MANAGEMENT/ADMINISTRATION","Business mgmt./Intl. bus./Public affairs/Hotel & rest. mgmt.",148.75831199999999,790,2006,5482,5482]
[995,"Business & Management","HOTEL/RESTAURANT MANAGEMENT","Business mgmt./Intl. bus./Public affairs/Hotel & rest. mgmt.",149.2357724,126,2006,5482,5482]
[1025,"Business & Management","INDUSTRIAL MANAGEMENT","Business mgmt./Intl. bus./Public affairs/Hotel & rest. mgmt.",151.5409836,61,2006,5482,5482]
[1040,"Business & Management","INDUSTRIAL RELATIONS","Business mgmt./Intl. bus./Public affairs/Hotel & rest. mgmt.",157.31481479999999,109,2006,5482,5482]
[1128,"Business & Management","INTERNATIONAL BUSINESS","Business mgmt./Intl. bus./Public affairs/Hotel & rest. mgmt.",152.3718245,870,2006,5482,5482]
[1330,"Social Sciences & Helping Professions","MILITARY SCIENCE","Business mgmt./Intl. bus./Public affairs/Hotel & rest. mgmt.",144.375,8,2006,5482,5482]
[1423,"Business & Management","PERSONNEL MANAGEMENT","Business mgmt./Intl. bus./Public affairs/Hotel & rest. mgmt.",148.26623380000001,157,2006,5482,5482]
[1645,"Social Sciences & Helping Professions","PUBLIC AFFAIRS/SERVICES/ADMIN","Business mgmt./Intl. bus./Public affairs/Hotel & rest. mgmt.",149.75494069999999,255,2006,5482,5482]
[1908,"Business & Management","TRANSPORTATION AND COMMERCE","Business mgmt./Intl. bus./Public affairs/Hotel & rest. mgmt.",152.97402600000001,77,2006,5482,5482]
[254,"Natural Sciences","AVIATION SCIENCE","Business mgmt./Intl. bus./Public affairs/Hotel & rest. mgmt.",151.5,10,2007,4736,4736]
[379,"Business & Management","BUSINESS AND MANAGEMENT - OTHER","Business mgmt./Intl. bus./Public affairs/Hotel & rest. mgmt.",152.80728049999999,468,2007,4736,4736]
[409,"Business & Management","BUSINESS MANAGEMENT","Business mgmt./Intl. bus./Public affairs/Hotel & rest. mgmt.",150.02221170000001,2143,2007,4736,4736]
[424,"Business & Management","BUSINESS MANAGEMENT/ADMINISTRATION","Business mgmt./Intl. bus./Public affairs/Hotel & rest. mgmt.",148.72829580000001,633,2007,4736,4736]
[996,"Business & Management","HOTEL/RESTAURANT MANAGEMENT","Business mgmt./Intl. bus./Public affairs/Hotel & rest. mgmt.",150.15094339999999,107,2007,4736,4736]
[1026,"Business & Management","INDUSTRIAL MANAGEMENT","Business mgmt./Intl. bus./Public affairs/Hotel & rest. mgmt.",148.19999999999999,45,2007,4736,4736]
[1041,"Business & Management","INDUSTRIAL RELATIONS","Business mgmt./Intl. bus./Public affairs/Hotel & rest. mgmt.",157.0392157,102,2007,4736,4736]
[1129,"Business & Management","INTERNATIONAL BUSINESS","Business mgmt./Intl. bus./Public affairs/Hotel & rest. mgmt.",152.59664950000001,783,2007,4736,4736]
[1331,"Social Sciences & Helping Professions","MILITARY SCIENCE","Business mgmt./Intl. bus./Public affairs/Hotel & rest. mgmt.",151.18181820000001,11,2007,4736,4736]
[1424,"Business & Management","PERSONNEL MANAGEMENT","Business mgmt./Intl. bus./Public affairs/Hotel & rest. mgmt.",147.88372089999999,130,2007,4736,4736]
[1646,"Social Sciences & Helping Professions","PUBLIC AFFAIRS/SERVICES/ADMIN","Business mgmt./Intl. bus./Public affairs/Hotel & rest. mgmt.",149.7228916,251,2007,4736,4736]
[1909,"Business & Management","TRANSPORTATION AND COMMERCE","Business mgmt./Intl. bus./Public affairs/Hotel & rest. mgmt.",152.5283019,53,2007,4736,4736]
[255,"Natural Sciences","AVIATION SCIENCE","Business mgmt./Intl. bus./Public affairs/Hotel & rest. mgmt.",152.5,8,2008,4668,4668]
[380,"Business & Management","BUSINESS AND MANAGEMENT - OTHER","Business mgmt./Intl. bus./Public affairs/Hotel & rest. mgmt.",152.43418009999999,437,2008,4668,4668]
[410,"Business & Management","BUSINESS MANAGEMENT","Business mgmt./Intl. bus./Public affairs/Hotel & rest. mgmt.",150.03541079999999,2139,2008,4668,4668]
[425,"Business & Management","BUSINESS MANAGEMENT/ADMINISTRATION","Business mgmt./Intl. bus./Public affairs/Hotel & rest. mgmt.",148.3432392,681,2008,4668,4668]
[997,"Business & Management","HOTEL/RESTAURANT MANAGEMENT","Business mgmt./Intl. bus./Public affairs/Hotel & rest. mgmt.",149.13725489999999,102,2008,4668,4668]
[1027,"Business & Management","INDUSTRIAL MANAGEMENT","Business mgmt./Intl. bus./Public affairs/Hotel & rest. mgmt.",146.75,40,2008,4668,4668]
[1042,"Business & Management","INDUSTRIAL RELATIONS","Business mgmt./Intl. bus./Public affairs/Hotel & rest. mgmt.",156.71,100,2008,4668,4668]
[1130,"Business & Management","INTERNATIONAL BUSINESS","Business mgmt./Intl. bus./Public affairs/Hotel & rest. mgmt.",152.9030899,717,2008,4668,4668]
[1332,"Social Sciences & Helping Professions","MILITARY SCIENCE","Business mgmt./Intl. bus./Public affairs/Hotel & rest. mgmt.",149.8666667,15,2008,4668,4668]
[1425,"Business & Management","PERSONNEL MANAGEMENT","Business mgmt./Intl. bus./Public affairs/Hotel & rest. mgmt.",145.02112679999999,142,2008,4668,4668]
[1647,"Social Sciences & Helping Professions","PUBLIC AFFAIRS/SERVICES/ADMIN","Business mgmt./Intl. bus./Public affairs/Hotel & rest. mgmt.",150.0489796,246,2008,4668,4668]
[1910,"Business & Management","TRANSPORTATION AND COMMERCE","Business mgmt./Intl. bus./Public affairs/Hotel & rest. mgmt.",151.22499999999999,41,2008,4668,4668]
[256,"Natural Sciences","AVIATION SCIENCE","Business mgmt./Intl. bus./Public affairs/Hotel & rest. mgmt.",155.125,8,2009,4605,4605]
[381,"Business & Management","BUSINESS AND MANAGEMENT - OTHER","Business mgmt./Intl. bus./Public affairs/Hotel & rest. mgmt.",152.6932367,417,2009,4605,4605]
[411,"Business & Management","BUSINESS MANAGEMENT","Business mgmt./Intl. bus./Public affairs/Hotel & rest. mgmt.",150.2779343,2150,2009,4605,4605]
[426,"Business & Management","BUSINESS MANAGEMENT/ADMINISTRATION","Business mgmt./Intl. bus./Public affairs/Hotel & rest. mgmt.",148.67359999999999,632,2009,4605,4605]
[998,"Business & Management","HOTEL/RESTAURANT MANAGEMENT","Business mgmt./Intl. bus./Public affairs/Hotel & rest. mgmt.",149.4,115,2009,4605,4605]
[1028,"Business & Management","INDUSTRIAL MANAGEMENT","Business mgmt./Intl. bus./Public affairs/Hotel & rest. mgmt.",148.16666670000001,37,2009,4605,4605]
[1043,"Business & Management","INDUSTRIAL RELATIONS","Business mgmt./Intl. bus./Public affairs/Hotel & rest. mgmt.",157.2857143,84,2009,4605,4605]
[1131,"Business & Management","INTERNATIONAL BUSINESS","Business mgmt./Intl. bus./Public affairs/Hotel & rest. mgmt.",152.89159889999999,741,2009,4605,4605]
[1333,"Social Sciences & Helping Professions","MILITARY SCIENCE","Business mgmt./Intl. bus./Public affairs/Hotel & rest. mgmt.",151.3846154,13,2009,4605,4605]
[1426,"Business & Management","PERSONNEL MANAGEMENT","Business mgmt./Intl. bus./Public affairs/Hotel & rest. mgmt.",145.45217389999999,117,2009,4605,4605]
[1648,"Social Sciences & Helping Professions","PUBLIC AFFAIRS/SERVICES/ADMIN","Business mgmt./Intl. bus./Public affairs/Hotel & rest. mgmt.",150.74596769999999,249,2009,4605,4605]
[1911,"Business & Management","TRANSPORTATION AND COMMERCE","Business mgmt./Intl. bus./Public affairs/Hotel & rest. mgmt.",151.73170730000001,42,2009,4605,4605]
[257,"Natural Sciences","AVIATION SCIENCE","Business mgmt./Intl. bus./Public affairs/Hotel & rest. mgmt.",150.8666667,15,2010,4828,4828]
[382,"Business & Management","BUSINESS AND MANAGEMENT - OTHER","Business mgmt./Intl. bus./Public affairs/Hotel & rest. mgmt.",153.3855422,418,2010,4828,4828]
[412,"Business & Management","BUSINESS MANAGEMENT","Business mgmt./Intl. bus./Public affairs/Hotel & rest. mgmt.",150.40450989999999,2201,2010,4828,4828]
[427,"Business & Management","BUSINESS MANAGEMENT/ADMINISTRATION","Business mgmt./Intl. bus./Public affairs/Hotel & rest. mgmt.",148.7079277,727,2010,4828,4828]
[999,"Business & Management","HOTEL/RESTAURANT MANAGEMENT","Business mgmt./Intl. bus./Public affairs/Hotel & rest. mgmt.",151.3475177,141,2010,4828,4828]
[1029,"Business & Management","INDUSTRIAL MANAGEMENT","Business mgmt./Intl. bus./Public affairs/Hotel & rest. mgmt.",146.2222222,37,2010,4828,4828]
[1044,"Business & Management","INDUSTRIAL RELATIONS","Business mgmt./Intl. bus./Public affairs/Hotel & rest. mgmt.",158.61797749999999,89,2010,4828,4828]
[1132,"Business & Management","INTERNATIONAL BUSINESS","Business mgmt./Intl. bus./Public affairs/Hotel & rest. mgmt.",153.08735329999999,769,2010,4828,{"$f":"VLOOKUP(D642&G642,$M$2:$P$436,4)","v":4828}]
[1334,"Social Sciences & Helping Professions","MILITARY SCIENCE","Business mgmt./Intl. bus./Public affairs/Hotel & rest. mgmt.",148.8461538,13,2010,4828,4828]
[1427,"Business & Management","PERSONNEL MANAGEMENT","Business mgmt./Intl. bus./Public affairs/Hotel & rest. mgmt.",146.6859504,121,2010,4828,4828]
[1649,"Social Sciences & Helping Professions","PUBLIC AFFAIRS/SERVICES/ADMIN","Business mgmt./Intl. bus./Public affairs/Hotel & rest. mgmt.",149.04435480000001,248,2010,4828,4828]
[1912,"Business & Management","TRANSPORTATION AND COMMERCE","Business mgmt./Intl. bus./Public affairs/Hotel & rest. mgmt.",149.5625,49,2010,4828,4828]
[258,"Natural Sciences","AVIATION SCIENCE","Business mgmt./Intl. bus./Public affairs/Hotel & rest. mgmt.",153.22727269999999,22,2011,5432,5432]
[383,"Business & Management","BUSINESS AND MANAGEMENT - OTHER","Business mgmt./Intl. bus./Public affairs/Hotel & rest. mgmt.",154.34563109999999,515,2011,5432,5432]
[413,"Business & Management","BUSINESS MANAGEMENT","Business mgmt./Intl. bus./Public affairs/Hotel & rest. mgmt.",150.76759150000001,2503,2011,5432,5432]
[428,"Business & Management","BUSINESS MANAGEMENT/ADMINISTRATION","Business mgmt./Intl. bus./Public affairs/Hotel & rest. mgmt.",149.2449799,753,2011,5432,5432]
[1000,"Business & Management","HOTEL/RESTAURANT MANAGEMENT","Business mgmt./Intl. bus./Public affairs/Hotel & rest. mgmt.",151.70253159999999,158,2011,5432,5432]
[1030,"Business & Management","INDUSTRIAL MANAGEMENT","Business mgmt./Intl. bus./Public affairs/Hotel & rest. mgmt.",151.42500000000001,40,2011,5432,5432]
[1045,"Business & Management","INDUSTRIAL RELATIONS","Business mgmt./Intl. bus./Public affairs/Hotel & rest. mgmt.",158.7126437,87,2011,5432,5432]
[1133,"Business & Management","INTERNATIONAL BUSINESS","Business mgmt./Intl. bus./Public affairs/Hotel & rest. mgmt.",153.18912800000001,885,2011,5432,5432]
[1335,"Social Sciences & Helping Professions","MILITARY SCIENCE","Business mgmt./Intl. bus./Public affairs/Hotel & rest. mgmt.",149.4375,16,2011,5432,5432]
[1428,"Business & Management","PERSONNEL MANAGEMENT","Business mgmt./Intl. bus./Public affairs/Hotel & rest. mgmt.",147.09523809999999,126,2011,5432,5432]
[1650,"Social Sciences & Helping Professions","PUBLIC AFFAIRS/SERVICES/ADMIN","Business mgmt./Intl. bus./Public affairs/Hotel & rest. mgmt.",150.35059759999999,254,2011,5432,5432]
[1913,"Business & Management","TRANSPORTATION AND COMMERCE","Business mgmt./Intl. bus./Public affairs/Hotel & rest. mgmt.",150.9014085,73,2011,5432,5432]
[259,"Natural Sciences","AVIATION SCIENCE","Business mgmt./Intl. bus./Public affairs/Hotel & rest. mgmt.",151,13,2012,4755,4755]
[384,"Business & Management","BUSINESS AND MANAGEMENT - OTHER","Business mgmt./Intl. bus./Public affairs/Hotel & rest. mgmt.",154.07203390000001,473,2012,4755,4755]
[414,"Business & Management","BUSINESS MANAGEMENT","Business mgmt./Intl. bus./Public affairs/Hotel & rest. mgmt.",150.7809785,2201,2012,4755,4755]
[429,"Business & Management","BUSINESS MANAGEMENT/ADMINISTRATION","Business mgmt./Intl. bus./Public affairs/Hotel & rest. mgmt.",148.98248179999999,689,2012,4755,4755]
[1001,"Business & Management","HOTEL/RESTAURANT MANAGEMENT","Business mgmt./Intl. bus./Public affairs/Hotel & rest. mgmt.",151.6993464,154,2012,4755,4755]
[1031,"Business & Management","INDUSTRIAL MANAGEMENT","Business mgmt./Intl. bus./Public affairs/Hotel & rest. mgmt.",151.3243243,37,2012,4755,4755]
[1046,"Business & Management","INDUSTRIAL RELATIONS","Business mgmt./Intl. bus./Public affairs/Hotel & rest. mgmt.",159.43076919999999,65,2012,4755,4755]
[1134,"Business & Management","INTERNATIONAL BUSINESS","Business mgmt./Intl. bus./Public affairs/Hotel & rest. mgmt.",153.4810659,714,2012,4755,4755]
[1336,"Social Sciences & Helping Professions","MILITARY SCIENCE","Business mgmt./Intl. bus./Public affairs/Hotel & rest. mgmt.",149.9375,16,2012,4755,4755]
[1429,"Business & Management","PERSONNEL MANAGEMENT","Business mgmt./Intl. bus./Public affairs/Hotel & rest. mgmt.",144.98823530000001,87,2012,4755,4755]
[1651,"Social Sciences & Helping Professions","PUBLIC AFFAIRS/SERVICES/ADMIN","Business mgmt./Intl. bus./Public affairs/Hotel & rest. mgmt.",150.17460320000001,255,2012,4755,4755]
[1914,"Business & Management","TRANSPORTATION AND COMMERCE","Business mgmt./Intl. bus./Public affairs/Hotel & rest. mgmt.",151.1,51,2012,4755,4755]
[260,"Natural Sciences","AVIATION SCIENCE","Business mgmt./Intl. bus./Public affairs/Hotel & rest. mgmt.",149.69999999999999,10,2013,4066,4066]
[385,"Business & Management","BUSINESS AND MANAGEMENT - OTHER","Business mgmt./Intl. bus./Public affairs/Hotel & rest. mgmt.",153.8798956,383,2013,4066,4066]
[415,"Business & Management","BUSINESS MANAGEMENT","Business mgmt./Intl. bus./Public affairs/Hotel & rest. mgmt.",150.08197609999999,1868,2013,4066,4066]
[430,"Business & Management","BUSINESS MANAGEMENT/ADMINISTRATION","Business mgmt./Intl. bus./Public affairs/Hotel & rest. mgmt.",148.15,609,2013,4066,4066]
[1002,"Business & Management","HOTEL/RESTAURANT MANAGEMENT","Business mgmt./Intl. bus./Public affairs/Hotel & rest. mgmt.",150.1584158,101,2013,4066,4066]
[1032,"Business & Management","INDUSTRIAL MANAGEMENT","Business mgmt./Intl. bus./Public affairs/Hotel & rest. mgmt.",150.68421050000001,19,2013,4066,4066]
[1047,"Business & Management","INDUSTRIAL RELATIONS","Business mgmt./Intl. bus./Public affairs/Hotel & rest. mgmt.",158.83333329999999,67,2013,4066,4066]
[1135,"Business & Management","INTERNATIONAL BUSINESS","Business mgmt./Intl. bus./Public affairs/Hotel & rest. mgmt.",153.10598289999999,591,2013,4066,4066]
[1337,"Social Sciences & Helping Professions","MILITARY SCIENCE","Business mgmt./Intl. bus./Public affairs/Hotel & rest. mgmt.",148.69230769999999,13,2013,4066,4066]
[1430,"Business & Management","PERSONNEL MANAGEMENT","Business mgmt./Intl. bus./Public affairs/Hotel & rest. mgmt.",146.5376344,94,2013,4066,4066]
[1652,"Social Sciences & Helping Professions","PUBLIC AFFAIRS/SERVICES/ADMIN","Business mgmt./Intl. bus./Public affairs/Hotel & rest. mgmt.",149.4642857,254,2013,4066,4066]
[1915,"Business & Management","TRANSPORTATION AND COMMERCE","Business mgmt./Intl. bus./Public affairs/Hotel & rest. mgmt.",153.15789470000001,57,2013,4066,4066]
[261,"Natural Sciences","AVIATION SCIENCE","Business mgmt./Intl. bus./Public affairs/Hotel & rest. mgmt.",149.14285709999999,7,2014,3372,3372]
[386,"Business & Management","BUSINESS AND MANAGEMENT - OTHER","Business mgmt./Intl. bus./Public affairs/Hotel & rest. mgmt.",153.4,359,2014,3372,3372]
[416,"Business & Management","BUSINESS MANAGEMENT","Business mgmt./Intl. bus./Public affairs/Hotel & rest. mgmt.",150.1226542,1528,2014,3372,3372]
[431,"Business & Management","BUSINESS MANAGEMENT/ADMINISTRATION","Business mgmt./Intl. bus./Public affairs/Hotel & rest. mgmt.",147.19114690000001,509,2014,3372,3372]
[1003,"Business & Management","HOTEL/RESTAURANT MANAGEMENT","Business mgmt./Intl. bus./Public affairs/Hotel & rest. mgmt.",151.6705882,86,2014,3372,3372]
[1033,"Business & Management","INDUSTRIAL MANAGEMENT","Business mgmt./Intl. bus./Public affairs/Hotel & rest. mgmt.",147.5357143,29,2014,3372,3372]
[1048,"Business & Management","INDUSTRIAL RELATIONS","Business mgmt./Intl. bus./Public affairs/Hotel & rest. mgmt.",161.32075470000001,54,2014,3372,3372]
[1136,"Business & Management","INTERNATIONAL BUSINESS","Business mgmt./Intl. bus./Public affairs/Hotel & rest. mgmt.",151.9212766,475,2014,3372,3372]
[1338,"Social Sciences & Helping Professions","MILITARY SCIENCE","Business mgmt./Intl. bus./Public affairs/Hotel & rest. mgmt.",149.80000000000001,6,2014,3372,3372]
[1431,"Business & Management","PERSONNEL MANAGEMENT","Business mgmt./Intl. bus./Public affairs/Hotel & rest. mgmt.",145.66666670000001,65,2014,3372,3372]
[1653,"Social Sciences & Helping Professions","PUBLIC AFFAIRS/SERVICES/ADMIN","Business mgmt./Intl. bus./Public affairs/Hotel & rest. mgmt.",149.5844749,222,2014,3372,3372]
[1916,"Business & Management","TRANSPORTATION AND COMMERCE","Business mgmt./Intl. bus./Public affairs/Hotel & rest. mgmt.",154.67741939999999,32,2014,3372,3372]
[262,"Natural Sciences","AVIATION SCIENCE","Business mgmt./Intl. bus./Public affairs/Hotel & rest. mgmt.",148.55555559999999,9,2015,3106,3106]
[387,"Business & Management","BUSINESS AND MANAGEMENT - OTHER","Business mgmt./Intl. bus./Public affairs/Hotel & rest. mgmt.",151.1401515,539,2015,3106,3106]
[417,"Business & Management","BUSINESS MANAGEMENT","Business mgmt./Intl. bus./Public affairs/Hotel & rest. mgmt.",149.55718949999999,1271,2015,3106,3106]
[432,"Business & Management","BUSINESS MANAGEMENT/ADMINISTRATION","Business mgmt./Intl. bus./Public affairs/Hotel & rest. mgmt.",147.7367089,403,2015,3106,3106]
[1004,"Business & Management","HOTEL/RESTAURANT MANAGEMENT","Business mgmt./Intl. bus./Public affairs/Hotel & rest. mgmt.",150.26249999999999,85,2015,3106,3106]
[1034,"Business & Management","INDUSTRIAL MANAGEMENT","Business mgmt./Intl. bus./Public affairs/Hotel & rest. mgmt.",150.1176471,18,2015,3106,3106]
[1049,"Business & Management","INDUSTRIAL RELATIONS","Business mgmt./Intl. bus./Public affairs/Hotel & rest. mgmt.",159.29166670000001,49,2015,3106,3106]
[1137,"Business & Management","INTERNATIONAL BUSINESS","Business mgmt./Intl. bus./Public affairs/Hotel & rest. mgmt.",151.81204819999999,425,2015,3106,3106]
[1339,"Social Sciences & Helping Professions","MILITARY SCIENCE","Business mgmt./Intl. bus./Public affairs/Hotel & rest. mgmt.",148.6,15,2015,3106,3106]
[1432,"Business & Management","PERSONNEL MANAGEMENT","Business mgmt./Intl. bus./Public affairs/Hotel & rest. mgmt.",148.54166670000001,55,2015,3106,3106]
[1654,"Social Sciences & Helping Professions","PUBLIC AFFAIRS/SERVICES/ADMIN","Business mgmt./Intl. bus./Public affairs/Hotel & rest. mgmt.",148.62,207,2015,3106,3106]
[1917,"Business & Management","TRANSPORTATION AND COMMERCE","Business mgmt./Intl. bus./Public affairs/Hotel & rest. mgmt.",150.16666670000001,30,2015,3106,{"$f":"VLOOKUP(D706&G706,$M$2:$P$436,4)","v":3106}]
[263,"Natural Sciences","AVIATION SCIENCE","Business mgmt./Intl. bus./Public affairs/Hotel & rest. mgmt.",150.375,8,2016,2864,2864]
[388,"Business & Management","BUSINESS AND MANAGEMENT - OTHER","Business mgmt./Intl. bus./Public affairs/Hotel & rest. mgmt.",150.51313490000001,585,2016,2864,2864]
[418,"Business & Management","BUSINESS MANAGEMENT","Business mgmt./Intl. bus./Public affairs/Hotel & rest. mgmt.",149.13606089999999,1085,2016,2864,2864]
[433,"Business & Management","BUSINESS MANAGEMENT/ADMINISTRATION","Business mgmt./Intl. bus./Public affairs/Hotel & rest. mgmt.",147.98416889999999,394,2016,2864,2864]
[1005,"Business & Management","HOTEL/RESTAURANT MANAGEMENT","Business mgmt./Intl. bus./Public affairs/Hotel & rest. mgmt.",150.76623380000001,78,2016,2864,2864]
[1035,"Business & Management","INDUSTRIAL MANAGEMENT","Business mgmt./Intl. bus./Public affairs/Hotel & rest. mgmt.",142.58333329999999,13,2016,2864,2864]
[1050,"Business & Management","INDUSTRIAL RELATIONS","Business mgmt./Intl. bus./Public affairs/Hotel & rest. mgmt.",159.43589739999999,40,2016,2864,2864]
[1138,"Business & Management","INTERNATIONAL BUSINESS","Business mgmt./Intl. bus./Public affairs/Hotel & rest. mgmt.",151.72533329999999,380,2016,2864,2864]
[1340,"Social Sciences & Helping Professions","MILITARY SCIENCE","Business mgmt./Intl. bus./Public affairs/Hotel & rest. mgmt.",153.63636360000001,12,2016,2864,2864]
[1433,"Business & Management","PERSONNEL MANAGEMENT","Business mgmt./Intl. bus./Public affairs/Hotel & rest. mgmt.",141.5,24,2016,2864,2864]
[1655,"Social Sciences & Helping Professions","PUBLIC AFFAIRS/SERVICES/ADMIN","Business mgmt./Intl. bus./Public affairs/Hotel & rest. mgmt.",149.91981129999999,219,2016,2864,2864]
[1918,"Business & Management","TRANSPORTATION AND COMMERCE","Business mgmt./Intl. bus./Public affairs/Hotel & rest. mgmt.",155.2692308,26,2016,2864,2864]
[274,"Natural Sciences","BIOCHEMISTRY","Chemistry/Biochemistry",157.74716979999999,268,2002,897,897]
[434,"Natural Sciences","CHEMISTRY, GENERAL","Chemistry/Biochemistry",155.4,557,2002,897,897]
[449,"Natural Sciences","CHEMISTRY, SPECIALIZATION","Chemistry/Biochemistry",153.02816899999999,72,2002,897,897]
[275,"Natural Sciences","BIOCHEMISTRY","Chemistry/Biochemistry",157.6006826,295,2003,989,989]
[435,"Natural Sciences","CHEMISTRY, GENERAL","Chemistry/Biochemistry",155.66501650000001,610,2003,989,989]
[450,"Natural Sciences","CHEMISTRY, SPECIALIZATION","Chemistry/Biochemistry",153.7857143,84,2003,989,989]
[276,"Natural Sciences","BIOCHEMISTRY","Chemistry/Biochemistry",156.762215,308,2004,987,987]
[436,"Natural Sciences","CHEMISTRY, GENERAL","Chemistry/Biochemistry",155.2262522,588,2004,987,987]
[451,"Natural Sciences","CHEMISTRY, SPECIALIZATION","Chemistry/Biochemistry",153.62921349999999,91,2004,987,987]
[277,"Natural Sciences","BIOCHEMISTRY","Chemistry/Biochemistry",157.69718309999999,285,2005,967,967]
[437,"Natural Sciences","CHEMISTRY, GENERAL","Chemistry/Biochemistry",155.42218539999999,607,2005,967,967]
[452,"Natural Sciences","CHEMISTRY, SPECIALIZATION","Chemistry/Biochemistry",155.36000000000001,75,2005,967,967]
[278,"Natural Sciences","BIOCHEMISTRY","Chemistry/Biochemistry",157.69047620000001,255,2006,895,895]
[438,"Natural Sciences","CHEMISTRY, GENERAL","Chemistry/Biochemistry",155.59929080000001,568,2006,895,895]
[453,"Natural Sciences","CHEMISTRY, SPECIALIZATION","Chemistry/Biochemistry",154.1549296,72,2006,895,895]
[279,"Natural Sciences","BIOCHEMISTRY","Chemistry/Biochemistry",157.77220080000001,261,2007,853,853]
[439,"Natural Sciences","CHEMISTRY, GENERAL","Chemistry/Biochemistry",156.30000000000001,514,2007,853,853]
[454,"Natural Sciences","CHEMISTRY, SPECIALIZATION","Chemistry/Biochemistry",155.57692309999999,78,2007,853,853]
[280,"Natural Sciences","BIOCHEMISTRY","Chemistry/Biochemistry",157.48917750000001,232,2008,705,705]
[440,"Natural Sciences","CHEMISTRY, GENERAL","Chemistry/Biochemistry",156.0147059,412,2008,705,705]
[455,"Natural Sciences","CHEMISTRY, SPECIALIZATION","Chemistry/Biochemistry",156.7868852,61,2008,705,705]
[281,"Natural Sciences","BIOCHEMISTRY","Chemistry/Biochemistry",157.36254980000001,251,2009,762,762]
[441,"Natural Sciences","CHEMISTRY, GENERAL","Chemistry/Biochemistry",155.97737559999999,444,2009,762,762]
[456,"Natural Sciences","CHEMISTRY, SPECIALIZATION","Chemistry/Biochemistry",155.7014925,67,2009,762,762]
[282,"Natural Sciences","BIOCHEMISTRY","Chemistry/Biochemistry",157.51599999999999,250,2010,785,785]
[442,"Natural Sciences","CHEMISTRY, GENERAL","Chemistry/Biochemistry",155.7647059,460,2010,785,785]
[457,"Natural Sciences","CHEMISTRY, SPECIALIZATION","Chemistry/Biochemistry",154,75,2010,785,785]
[283,"Natural Sciences","BIOCHEMISTRY","Chemistry/Biochemistry",158.74299070000001,216,2011,672,672]
[443,"Natural Sciences","CHEMISTRY, GENERAL","Chemistry/Biochemistry",156.53589740000001,397,2011,672,672]
[458,"Natural Sciences","CHEMISTRY, SPECIALIZATION","Chemistry/Biochemistry",156.6551724,59,2011,672,672]
[284,"Natural Sciences","BIOCHEMISTRY","Chemistry/Biochemistry",157.68717950000001,195,2012,621,621]
[444,"Natural Sciences","CHEMISTRY, GENERAL","Chemistry/Biochemistry",155.3653846,367,2012,621,621]
[459,"Natural Sciences","CHEMISTRY, SPECIALIZATION","Chemistry/Biochemistry",158.37931029999999,59,2012,621,621]
[285,"Natural Sciences","BIOCHEMISTRY","Chemistry/Biochemistry",158.54736840000001,192,2013,548,548]
[445,"Natural Sciences","CHEMISTRY, GENERAL","Chemistry/Biochemistry",155.8921569,310,2013,548,548]
[460,"Natural Sciences","CHEMISTRY, SPECIALIZATION","Chemistry/Biochemistry",157.4,46,2013,548,548]
[286,"Natural Sciences","BIOCHEMISTRY","Chemistry/Biochemistry",158.3831169,155,2014,452,452]
[446,"Natural Sciences","CHEMISTRY, GENERAL","Chemistry/Biochemistry",155.108,255,2014,452,452]
[461,"Natural Sciences","CHEMISTRY, SPECIALIZATION","Chemistry/Biochemistry",154.16666670000001,42,2014,452,452]
[287,"Natural Sciences","BIOCHEMISTRY","Chemistry/Biochemistry",158.56028370000001,143,2015,429,429]
[447,"Natural Sciences","CHEMISTRY, GENERAL","Chemistry/Biochemistry",154.3467742,256,2015,429,429]
[462,"Natural Sciences","CHEMISTRY, SPECIALIZATION","Chemistry/Biochemistry",152.93333329999999,30,2015,429,429]
[288,"Natural Sciences","BIOCHEMISTRY","Chemistry/Biochemistry",157.81879190000001,151,2016,452,452]
[448,"Natural Sciences","CHEMISTRY, GENERAL","Chemistry/Biochemistry",155.18359380000001,264,2016,452,452]
[463,"Natural Sciences","CHEMISTRY, SPECIALIZATION","Chemistry/Biochemistry",153.16666670000001,37,2016,452,452]
[479,"Arts & Humanities","COMMUNICATIONS","Communications/Journalism",150.32057030000001,2475,2002,3665,3665]
[1161,"Arts & Humanities","JOURNALISM","Communications/Journalism",152.37768679999999,986,2002,3665,3665]
[1837,"Arts & Humanities","SPEECH","Communications/Journalism",150.70588240000001,204,2002,3665,3665]
[480,"Arts & Humanities","COMMUNICATIONS","Communications/Journalism",150.88763320000001,3116,2003,4566,4566]
[1162,"Arts & Humanities","JOURNALISM","Communications/Journalism",152.7223127,1236,2003,4566,4566]
[1838,"Arts & Humanities","SPEECH","Communications/Journalism",150.78971960000001,214,2003,4566,4566]
[481,"Arts & Humanities","COMMUNICATIONS","Communications/Journalism",150.76762769999999,3519,2004,5069,{"$f":"VLOOKUP(D770&G770,$M$2:$P$436,4)","v":5069}]
[1163,"Arts & Humanities","JOURNALISM","Communications/Journalism",152.8520408,1375,2004,5069,5069]
[1839,"Arts & Humanities","SPEECH","Communications/Journalism",150.7485714,175,2004,5069,5069]
[482,"Arts & Humanities","COMMUNICATIONS","Communications/Journalism",151.214225,3546,2005,5092,5092]
[1164,"Arts & Humanities","JOURNALISM","Communications/Journalism",153.34464940000001,1360,2005,5092,5092]
[1840,"Arts & Humanities","SPEECH","Communications/Journalism",150.43548390000001,186,2005,5092,5092]
[483,"Arts & Humanities","COMMUNICATIONS","Communications/Journalism",151.8430161,3257,2006,4796,4796]
[1165,"Arts & Humanities","JOURNALISM","Communications/Journalism",153.95611510000001,1398,2006,4796,4796]
[1841,"Arts & Humanities","SPEECH","Communications/Journalism",151.45323740000001,141,2006,4796,4796]
[484,"Arts & Humanities","COMMUNICATIONS","Communications/Journalism",151.648315,3016,2007,4540,4540]
[1166,"Arts & Humanities","JOURNALISM","Communications/Journalism",153.681128,1390,2007,4540,4540]
[1842,"Arts & Humanities","SPEECH","Communications/Journalism",151.3507463,134,2007,4540,4540]
[485,"Arts & Humanities","COMMUNICATIONS","Communications/Journalism",151.90288899999999,2890,2008,4291,4291]
[1167,"Arts & Humanities","JOURNALISM","Communications/Journalism",153.9352069,1283,2008,4291,4291]
[1843,"Arts & Humanities","SPEECH","Communications/Journalism",152.00854699999999,118,2008,4291,4291]
[486,"Arts & Humanities","COMMUNICATIONS","Communications/Journalism",151.51063830000001,2832,2009,4233,4233]
[1168,"Arts & Humanities","JOURNALISM","Communications/Journalism",154.4791022,1293,2009,4233,4233]
[1844,"Arts & Humanities","SPEECH","Communications/Journalism",152.33333329999999,108,2009,4233,4233]
[487,"Arts & Humanities","COMMUNICATIONS","Communications/Journalism",151.96239869999999,3100,2010,4569,4569]
[1169,"Arts & Humanities","JOURNALISM","Communications/Journalism",154.40670549999999,1374,2010,4569,4569]
[1845,"Arts & Humanities","SPEECH","Communications/Journalism",149.3297872,95,2010,4569,4569]
[488,"Arts & Humanities","COMMUNICATIONS","Communications/Journalism",152.12594609999999,3318,2011,4907,4907]
[1170,"Arts & Humanities","JOURNALISM","Communications/Journalism",154.7142857,1512,2011,4907,4907]
[1846,"Arts & Humanities","SPEECH","Communications/Journalism",151.92207790000001,77,2011,4907,4907]
[489,"Arts & Humanities","COMMUNICATIONS","Communications/Journalism",151.7254417,2837,2012,4121,4121]
[1171,"Arts & Humanities","JOURNALISM","Communications/Journalism",154.09950660000001,1220,2012,4121,4121]
[1847,"Arts & Humanities","SPEECH","Communications/Journalism",149.33333329999999,64,2012,4121,4121]
[490,"Arts & Humanities","COMMUNICATIONS","Communications/Journalism",151.67748739999999,2390,2013,3440,3440]
[1172,"Arts & Humanities","JOURNALISM","Communications/Journalism",154.178,1001,2013,3440,3440]
[1848,"Arts & Humanities","SPEECH","Communications/Journalism",150.20408159999999,49,2013,3440,3440]
[491,"Arts & Humanities","COMMUNICATIONS","Communications/Journalism",151.37210450000001,2059,2014,2896,2896]
[1173,"Arts & Humanities","JOURNALISM","Communications/Journalism",153.52387100000001,789,2014,2896,2896]
[1849,"Arts & Humanities","SPEECH","Communications/Journalism",151.97916670000001,48,2014,2896,2896]
[492,"Arts & Humanities","COMMUNICATIONS","Communications/Journalism",151.44963419999999,1805,2015,2557,2557]
[1174,"Arts & Humanities","JOURNALISM","Communications/Journalism",152.69219860000001,719,2015,2557,2557]
[1850,"Arts & Humanities","SPEECH","Communications/Journalism",149.15151520000001,33,2015,2557,2557]
[493,"Arts & Humanities","COMMUNICATIONS","Communications/Journalism",151.0197517,1809,2016,2508,2508]
[1175,"Arts & Humanities","JOURNALISM","Communications/Journalism",153.11317829999999,657,2016,2508,2508]
[1851,"Arts & Humanities","SPEECH","Communications/Journalism",148.92857140000001,42,2016,2508,2508]
[494,"Computer Science","COMPUTER INFORMATION SYSTEMS","Computer science/Comp. info. systems/Mgmt. info. systems",149.6972973,187,2002,578,578]
[509,"Computer Science","COMPUTER PROGRAMMING","Computer science/Comp. info. systems/Mgmt. info. systems",147.07142859999999,15,2002,578,578]
[524,"Computer Science","COMPUTER SCIENCE - OTHER","Computer science/Comp. info. systems/Mgmt. info. systems",155.2264151,56,2002,578,578]
[539,"Computer Science","COMPUTER SCIENCE, GENERAL","Computer science/Comp. info. systems/Mgmt. info. systems",156.7315175,262,2002,578,578]
[1051,"Computer Science","INFORMATION SCIENCES","Computer science/Comp. info. systems/Mgmt. info. systems",150.45945950000001,37,2002,578,578]
[1236,"Computer Science","MANAGEMENT INFORMATION SYSTEMS","Computer science/Comp. info. systems/Mgmt. info. systems",148.2857143,14,2002,578,578]
[1882,"Computer Science","SYSTEMS ANALYSIS","Computer science/Comp. info. systems/Mgmt. info. systems",150.57142859999999,7,2002,578,578]
[495,"Computer Science","COMPUTER INFORMATION SYSTEMS","Computer science/Comp. info. systems/Mgmt. info. systems",150.1365314,278,2003,1256,1256]
[510,"Computer Science","COMPUTER PROGRAMMING","Computer science/Comp. info. systems/Mgmt. info. systems",149.63636360000001,34,2003,1256,1256]
[525,"Computer Science","COMPUTER SCIENCE - OTHER","Computer science/Comp. info. systems/Mgmt. info. systems",158.47826090000001,72,2003,1256,1256]
[540,"Computer Science","COMPUTER SCIENCE, GENERAL","Computer science/Comp. info. systems/Mgmt. info. systems",159,513,2003,1256,1256]
[1052,"Computer Science","INFORMATION SCIENCES","Computer science/Comp. info. systems/Mgmt. info. systems",150.1230769,65,2003,1256,1256]
[1237,"Computer Science","MANAGEMENT INFORMATION SYSTEMS","Computer science/Comp. info. systems/Mgmt. info. systems",151.36267609999999,287,2003,1256,1256]
[1883,"Computer Science","SYSTEMS ANALYSIS","Computer science/Comp. info. systems/Mgmt. info. systems",154.57142859999999,7,2003,1256,1256]
[496,"Computer Science","COMPUTER INFORMATION SYSTEMS","Computer science/Comp. info. systems/Mgmt. info. systems",149.0386598,394,2004,1886,1886]
[511,"Computer Science","COMPUTER PROGRAMMING","Computer science/Comp. info. systems/Mgmt. info. systems",152.3859649,58,2004,1886,1886]
[526,"Computer Science","COMPUTER SCIENCE - OTHER","Computer science/Comp. info. systems/Mgmt. info. systems",155.8588235,85,2004,1886,1886]
[541,"Computer Science","COMPUTER SCIENCE, GENERAL","Computer science/Comp. info. systems/Mgmt. info. systems",158.6618421,766,2004,1886,1886]
[1053,"Computer Science","INFORMATION SCIENCES","Computer science/Comp. info. systems/Mgmt. info. systems",151.42352940000001,85,2004,1886,1886]
[1238,"Computer Science","MANAGEMENT INFORMATION SYSTEMS","Computer science/Comp. info. systems/Mgmt. info. systems",152.18426500000001,487,2004,1886,1886]
[1884,"Computer Science","SYSTEMS ANALYSIS","Computer science/Comp. info. systems/Mgmt. info. systems",155.54545450000001,11,2004,1886,1886]
[497,"Computer Science","COMPUTER INFORMATION SYSTEMS","Computer science/Comp. info. systems/Mgmt. info. systems",149.84,404,2005,2153,2153]
[512,"Computer Science","COMPUTER PROGRAMMING","Computer science/Comp. info. systems/Mgmt. info. systems",152.4814815,81,2005,2153,2153]
[527,"Computer Science","COMPUTER SCIENCE - OTHER","Computer science/Comp. info. systems/Mgmt. info. systems",155.87735850000001,108,2005,2153,2153]
[542,"Computer Science","COMPUTER SCIENCE, GENERAL","Computer science/Comp. info. systems/Mgmt. info. systems",158.51931329999999,939,2005,2153,2153]
[1054,"Computer Science","INFORMATION SCIENCES","Computer science/Comp. info. systems/Mgmt. info. systems",152.64761899999999,106,2005,2153,{"$f":"VLOOKUP(D834&G834,$M$2:$P$436,4)","v":2153}]
[1239,"Computer Science","MANAGEMENT INFORMATION SYSTEMS","Computer science/Comp. info. systems/Mgmt. info. systems",152.4717742,503,2005,2153,2153]
[1885,"Computer Science","SYSTEMS ANALYSIS","Computer science/Comp. info. systems/Mgmt. info. systems",151.25,12,2005,2153,2153]
[498,"Computer Science","COMPUTER INFORMATION SYSTEMS","Computer science/Comp. info. systems/Mgmt. info. systems",149.48295450000001,354,2006,1900,1900]
[513,"Computer Science","COMPUTER PROGRAMMING","Computer science/Comp. info. systems/Mgmt. info. systems",153.69879520000001,83,2006,1900,1900]
[528,"Computer Science","COMPUTER SCIENCE - OTHER","Computer science/Comp. info. systems/Mgmt. info. systems",154.8125,65,2006,1900,1900]
[543,"Computer Science","COMPUTER SCIENCE, GENERAL","Computer science/Comp. info. systems/Mgmt. info. systems",159.48131369999999,887,2006,1900,1900]
[1055,"Computer Science","INFORMATION SCIENCES","Computer science/Comp. info. systems/Mgmt. info. systems",152.4673913,93,2006,1900,1900]
[1240,"Computer Science","MANAGEMENT INFORMATION SYSTEMS","Computer science/Comp. info. systems/Mgmt. info. systems",152.26419749999999,408,2006,1900,1900]
[1886,"Computer Science","SYSTEMS ANALYSIS","Computer science/Comp. info. systems/Mgmt. info. systems",151.30000000000001,10,2006,1900,1900]
[499,"Computer Science","COMPUTER INFORMATION SYSTEMS","Computer science/Comp. info. systems/Mgmt. info. systems",149.5394737,308,2007,1423,1423]
[514,"Computer Science","COMPUTER PROGRAMMING","Computer science/Comp. info. systems/Mgmt. info. systems",152.06382980000001,48,2007,1423,1423]
[529,"Computer Science","COMPUTER SCIENCE - OTHER","Computer science/Comp. info. systems/Mgmt. info. systems",152.69841270000001,64,2007,1423,1423]
[544,"Computer Science","COMPUTER SCIENCE, GENERAL","Computer science/Comp. info. systems/Mgmt. info. systems",159.1639098,668,2007,1423,1423]
[1056,"Computer Science","INFORMATION SCIENCES","Computer science/Comp. info. systems/Mgmt. info. systems",151.6216216,77,2007,1423,1423]
[1241,"Computer Science","MANAGEMENT INFORMATION SYSTEMS","Computer science/Comp. info. systems/Mgmt. info. systems",151.33600000000001,252,2007,1423,1423]
[1887,"Computer Science","SYSTEMS ANALYSIS","Computer science/Comp. info. systems/Mgmt. info. systems",150.16666670000001,6,2007,1423,1423]
[500,"Computer Science","COMPUTER INFORMATION SYSTEMS","Computer science/Comp. info. systems/Mgmt. info. systems",149.3440367,223,2008,1131,1131]
[515,"Computer Science","COMPUTER PROGRAMMING","Computer science/Comp. info. systems/Mgmt. info. systems",155.02000000000001,50,2008,1131,1131]
[530,"Computer Science","COMPUTER SCIENCE - OTHER","Computer science/Comp. info. systems/Mgmt. info. systems",153.7462687,68,2008,1131,1131]
[545,"Computer Science","COMPUTER SCIENCE, GENERAL","Computer science/Comp. info. systems/Mgmt. info. systems",159.03053439999999,528,2008,1131,1131]
[1057,"Computer Science","INFORMATION SCIENCES","Computer science/Comp. info. systems/Mgmt. info. systems",151.32727270000001,55,2008,1131,1131]
[1242,"Computer Science","MANAGEMENT INFORMATION SYSTEMS","Computer science/Comp. info. systems/Mgmt. info. systems",151.37,202,2008,1131,1131]
[1888,"Computer Science","SYSTEMS ANALYSIS","Computer science/Comp. info. systems/Mgmt. info. systems",149.19999999999999,5,2008,1131,1131]
[501,"Computer Science","COMPUTER INFORMATION SYSTEMS","Computer science/Comp. info. systems/Mgmt. info. systems",148.20329670000001,189,2009,900,900]
[516,"Computer Science","COMPUTER PROGRAMMING","Computer science/Comp. info. systems/Mgmt. info. systems",153.20454549999999,46,2009,900,900]
[531,"Computer Science","COMPUTER SCIENCE - OTHER","Computer science/Comp. info. systems/Mgmt. info. systems",154.94999999999999,41,2009,900,900]
[546,"Computer Science","COMPUTER SCIENCE, GENERAL","Computer science/Comp. info. systems/Mgmt. info. systems",158.6,416,2009,900,900]
[1058,"Computer Science","INFORMATION SCIENCES","Computer science/Comp. info. systems/Mgmt. info. systems",151.65853659999999,43,2009,900,900]
[1243,"Computer Science","MANAGEMENT INFORMATION SYSTEMS","Computer science/Comp. info. systems/Mgmt. info. systems",150.37195120000001,165,2009,900,900]
[502,"Computer Science","COMPUTER INFORMATION SYSTEMS","Computer science/Comp. info. systems/Mgmt. info. systems",147.4645161,158,2010,838,838]
[517,"Computer Science","COMPUTER PROGRAMMING","Computer science/Comp. info. systems/Mgmt. info. systems",152.1153846,52,2010,838,838]
[532,"Computer Science","COMPUTER SCIENCE - OTHER","Computer science/Comp. info. systems/Mgmt. info. systems",150.95744680000001,47,2010,838,838]
[547,"Computer Science","COMPUTER SCIENCE, GENERAL","Computer science/Comp. info. systems/Mgmt. info. systems",158.9153005,369,2010,838,838]
[1059,"Computer Science","INFORMATION SCIENCES","Computer science/Comp. info. systems/Mgmt. info. systems",152.8823529,52,2010,838,838]
[1244,"Computer Science","MANAGEMENT INFORMATION SYSTEMS","Computer science/Comp. info. systems/Mgmt. info. systems",150.3734177,160,2010,838,838]
[503,"Computer Science","COMPUTER INFORMATION SYSTEMS","Computer science/Comp. info. systems/Mgmt. info. systems",147.84375,163,2011,768,768]
[518,"Computer Science","COMPUTER PROGRAMMING","Computer science/Comp. info. systems/Mgmt. info. systems",151.44736839999999,38,2011,768,768]
[533,"Computer Science","COMPUTER SCIENCE - OTHER","Computer science/Comp. info. systems/Mgmt. info. systems",152.1836735,49,2011,768,768]
[548,"Computer Science","COMPUTER SCIENCE, GENERAL","Computer science/Comp. info. systems/Mgmt. info. systems",159.6213018,339,2011,768,768]
[1060,"Computer Science","INFORMATION SCIENCES","Computer science/Comp. info. systems/Mgmt. info. systems",149.79591840000001,49,2011,768,768]
[1245,"Computer Science","MANAGEMENT INFORMATION SYSTEMS","Computer science/Comp. info. systems/Mgmt. info. systems",151.8604651,130,2011,768,768]
[504,"Computer Science","COMPUTER INFORMATION SYSTEMS","Computer science/Comp. info. systems/Mgmt. info. systems",147.13445379999999,125,2012,633,633]
[519,"Computer Science","COMPUTER PROGRAMMING","Computer science/Comp. info. systems/Mgmt. info. systems",151.38888890000001,37,2012,633,633]
[534,"Computer Science","COMPUTER SCIENCE - OTHER","Computer science/Comp. info. systems/Mgmt. info. systems",152.2307692,53,2012,633,633]
[549,"Computer Science","COMPUTER SCIENCE, GENERAL","Computer science/Comp. info. systems/Mgmt. info. systems",157.19379839999999,258,2012,633,633]
[1061,"Computer Science","INFORMATION SCIENCES","Computer science/Comp. info. systems/Mgmt. info. systems",152.04255319999999,48,2012,633,633]
[1246,"Computer Science","MANAGEMENT INFORMATION SYSTEMS","Computer science/Comp. info. systems/Mgmt. info. systems",151.6636364,112,2012,633,633]
[505,"Computer Science","COMPUTER INFORMATION SYSTEMS","Computer science/Comp. info. systems/Mgmt. info. systems",146.2314815,115,2013,492,492]
[520,"Computer Science","COMPUTER PROGRAMMING","Computer science/Comp. info. systems/Mgmt. info. systems",148.06451609999999,33,2013,492,492]
[535,"Computer Science","COMPUTER SCIENCE - OTHER","Computer science/Comp. info. systems/Mgmt. info. systems",150.9565217,47,2013,492,492]
[550,"Computer Science","COMPUTER SCIENCE, GENERAL","Computer science/Comp. info. systems/Mgmt. info. systems",157.36470589999999,170,2013,492,492]
[1062,"Computer Science","INFORMATION SCIENCES","Computer science/Comp. info. systems/Mgmt. info. systems",153.78125,32,2013,492,492]
[1247,"Computer Science","MANAGEMENT INFORMATION SYSTEMS","Computer science/Comp. info. systems/Mgmt. info. systems",150.94736839999999,95,2013,492,492]
[506,"Computer Science","COMPUTER INFORMATION SYSTEMS","Computer science/Comp. info. systems/Mgmt. info. systems",146.0888889,92,2014,394,394]
[521,"Computer Science","COMPUTER PROGRAMMING","Computer science/Comp. info. systems/Mgmt. info. systems",148.5,14,2014,394,394]
[536,"Computer Science","COMPUTER SCIENCE - OTHER","Computer science/Comp. info. systems/Mgmt. info. systems",154.39393939999999,35,2014,394,394]
[551,"Computer Science","COMPUTER SCIENCE, GENERAL","Computer science/Comp. info. systems/Mgmt. info. systems",157.2198582,143,2014,394,394]
[1063,"Computer Science","INFORMATION SCIENCES","Computer science/Comp. info. systems/Mgmt. info. systems",151.87878789999999,35,2014,394,394]
[1248,"Computer Science","MANAGEMENT INFORMATION SYSTEMS","Computer science/Comp. info. systems/Mgmt. info. systems",149.89189189999999,75,2014,394,394]
[507,"Computer Science","COMPUTER INFORMATION SYSTEMS","Computer science/Comp. info. systems/Mgmt. info. systems",145.88059699999999,76,2015,333,333]
[522,"Computer Science","COMPUTER PROGRAMMING","Computer science/Comp. info. systems/Mgmt. info. systems",150.27272730000001,24,2015,333,333]
[537,"Computer Science","COMPUTER SCIENCE - OTHER","Computer science/Comp. info. systems/Mgmt. info. systems",148.43333329999999,32,2015,333,333]
[552,"Computer Science","COMPUTER SCIENCE, GENERAL","Computer science/Comp. info. systems/Mgmt. info. systems",156.42372879999999,120,2015,333,333]
[1064,"Computer Science","INFORMATION SCIENCES","Computer science/Comp. info. systems/Mgmt. info. systems",152.08000000000001,26,2015,333,{"$f":"VLOOKUP(D898&G898,$M$2:$P$436,4)","v":333}]
[1249,"Computer Science","MANAGEMENT INFORMATION SYSTEMS","Computer science/Comp. info. systems/Mgmt. info. systems",150.20754719999999,55,2015,333,333]
[508,"Computer Science","COMPUTER INFORMATION SYSTEMS","Computer science/Comp. info. systems/Mgmt. info. systems",145.50632909999999,87,2016,341,341]
[523,"Computer Science","COMPUTER PROGRAMMING","Computer science/Comp. info. systems/Mgmt. info. systems",148.75,16,2016,341,341]
[538,"Computer Science","COMPUTER SCIENCE - OTHER","Computer science/Comp. info. systems/Mgmt. info. systems",147.875,32,2016,341,341]
[553,"Computer Science","COMPUTER SCIENCE, GENERAL","Computer science/Comp. info. systems/Mgmt. info. systems",156.0241935,126,2016,341,341]
[1065,"Computer Science","INFORMATION SCIENCES","Computer science/Comp. info. systems/Mgmt. info. systems",146.29629629999999,27,2016,341,341]
[1250,"Computer Science","MANAGEMENT INFORMATION SYSTEMS","Computer science/Comp. info. systems/Mgmt. info. systems",152.05769230000001,53,2016,341,341]
[554,"Social Sciences & Helping Professions","CRIMINAL JUSTICE","Criminal Justice/Criminology",145.40519760000001,3812,2002,4517,4517]
[569,"Social Sciences & Helping Professions","CRIMINOLOGY","Criminal Justice/Criminology",147.97345129999999,684,2002,4517,4517]
[1539,"Social Sciences & Helping Professions","POLICE ADMINISTRATION","Criminal Justice/Criminology",144.2380952,21,2002,4517,4517]
[555,"Social Sciences & Helping Professions","CRIMINAL JUSTICE","Criminal Justice/Criminology",145.62306319999999,3966,2003,4723,4723]
[570,"Social Sciences & Helping Professions","CRIMINOLOGY","Criminal Justice/Criminology",148.52445650000001,740,2003,4723,4723]
[1540,"Social Sciences & Helping Professions","POLICE ADMINISTRATION","Criminal Justice/Criminology",140.82352940000001,17,2003,4723,4723]
[556,"Social Sciences & Helping Professions","CRIMINAL JUSTICE","Criminal Justice/Criminology",145.6412157,4082,2004,4888,4888]
[571,"Social Sciences & Helping Professions","CRIMINOLOGY","Criminal Justice/Criminology",148.29949239999999,791,2004,4888,4888]
[1541,"Social Sciences & Helping Professions","POLICE ADMINISTRATION","Criminal Justice/Criminology",141.64285709999999,15,2004,4888,4888]
[557,"Social Sciences & Helping Professions","CRIMINAL JUSTICE","Criminal Justice/Criminology",146.05464889999999,4092,2005,4957,4957]
[572,"Social Sciences & Helping Professions","CRIMINOLOGY","Criminal Justice/Criminology",148.8782506,853,2005,4957,4957]
[1542,"Social Sciences & Helping Professions","POLICE ADMINISTRATION","Criminal Justice/Criminology",145.0909091,12,2005,4957,4957]
[558,"Social Sciences & Helping Professions","CRIMINAL JUSTICE","Criminal Justice/Criminology",146.47483260000001,4067,2006,4936,4936]
[573,"Social Sciences & Helping Professions","CRIMINOLOGY","Criminal Justice/Criminology",149.23653400000001,858,2006,4936,4936]
[1543,"Social Sciences & Helping Professions","POLICE ADMINISTRATION","Criminal Justice/Criminology",143.1,11,2006,4936,4936]
[559,"Social Sciences & Helping Professions","CRIMINAL JUSTICE","Criminal Justice/Criminology",146.6880525,3997,2007,4899,4899]
[574,"Social Sciences & Helping Professions","CRIMINOLOGY","Criminal Justice/Criminology",149.4015837,893,2007,4899,4899]
[1544,"Social Sciences & Helping Professions","POLICE ADMINISTRATION","Criminal Justice/Criminology",142.66666670000001,9,2007,4899,4899]
[560,"Social Sciences & Helping Professions","CRIMINAL JUSTICE","Criminal Justice/Criminology",146.6907712,3982,2008,4942,4942]
[575,"Social Sciences & Helping Professions","CRIMINOLOGY","Criminal Justice/Criminology",150.2897787,951,2008,4942,4942]
[1545,"Social Sciences & Helping Professions","POLICE ADMINISTRATION","Criminal Justice/Criminology",141,9,2008,4942,4942]
[561,"Social Sciences & Helping Professions","CRIMINAL JUSTICE","Criminal Justice/Criminology",146.9253143,4099,2009,4969,4969]
[576,"Social Sciences & Helping Professions","CRIMINOLOGY","Criminal Justice/Criminology",149.676815,858,2009,4969,4969]
[1546,"Social Sciences & Helping Professions","POLICE ADMINISTRATION","Criminal Justice/Criminology",145,12,2009,4969,4969]
[562,"Social Sciences & Helping Professions","CRIMINAL JUSTICE","Criminal Justice/Criminology",146.91094849999999,3996,2010,4883,4883]
[577,"Social Sciences & Helping Professions","CRIMINOLOGY","Criminal Justice/Criminology",150.16994220000001,870,2010,4883,4883]
[1547,"Social Sciences & Helping Professions","POLICE ADMINISTRATION","Criminal Justice/Criminology",139.58823530000001,17,2010,4883,4883]
[563,"Social Sciences & Helping Professions","CRIMINAL JUSTICE","Criminal Justice/Criminology",146.77329109999999,3814,2011,4706,4706]
[578,"Social Sciences & Helping Professions","CRIMINOLOGY","Criminal Justice/Criminology",150.19657140000001,880,2011,4706,4706]
[1548,"Social Sciences & Helping Professions","POLICE ADMINISTRATION","Criminal Justice/Criminology",147.25,12,2011,4706,4706]
[564,"Social Sciences & Helping Professions","CRIMINAL JUSTICE","Criminal Justice/Criminology",146.60322830000001,3872,2012,4737,4737]
[579,"Social Sciences & Helping Professions","CRIMINOLOGY","Criminal Justice/Criminology",150.2843713,852,2012,4737,4737]
[1549,"Social Sciences & Helping Professions","POLICE ADMINISTRATION","Criminal Justice/Criminology",144.46153849999999,13,2012,4737,4737]
[565,"Social Sciences & Helping Professions","CRIMINAL JUSTICE","Criminal Justice/Criminology",146.35586900000001,3804,2013,4771,4771]
[580,"Social Sciences & Helping Professions","CRIMINOLOGY","Criminal Justice/Criminology",149.5279831,957,2013,4771,4771]
[1550,"Social Sciences & Helping Professions","POLICE ADMINISTRATION","Criminal Justice/Criminology",143.69999999999999,10,2013,4771,4771]
[566,"Social Sciences & Helping Professions","CRIMINAL JUSTICE","Criminal Justice/Criminology",145.9891792,3860,2014,4780,4780]
[581,"Social Sciences & Helping Professions","CRIMINOLOGY","Criminal Justice/Criminology",148.72049000000001,910,2014,4780,4780]
[1551,"Social Sciences & Helping Professions","POLICE ADMINISTRATION","Criminal Justice/Criminology",139.55555559999999,10,2014,4780,4780]
[567,"Social Sciences & Helping Professions","CRIMINAL JUSTICE","Criminal Justice/Criminology",145.95135869999999,3777,2015,4672,4672]
[582,"Social Sciences & Helping Professions","CRIMINOLOGY","Criminal Justice/Criminology",148.6880093,881,2015,4672,4672]
[1552,"Social Sciences & Helping Professions","POLICE ADMINISTRATION","Criminal Justice/Criminology",143.1538462,14,2015,4672,4672]
[568,"Social Sciences & Helping Professions","CRIMINAL JUSTICE","Criminal Justice/Criminology",145.7973369,3857,2016,4797,4797]
[583,"Social Sciences & Helping Professions","CRIMINOLOGY","Criminal Justice/Criminology",149.06623239999999,931,2016,4797,4797]
[1553,"Social Sciences & Helping Professions","POLICE ADMINISTRATION","Criminal Justice/Criminology",146.625,9,2016,4797,4797]
[614,"Business & Management","ECONOMICS","Economics",156.74654960000001,3202,2002,3202,3202]
[615,"Business & Management","ECONOMICS","Economics",157.11326940000001,4289,2003,4289,4289]
[616,"Business & Management","ECONOMICS","Economics",157.30140270000001,5433,2004,5433,5433]
[617,"Business & Management","ECONOMICS","Economics",157.42219919999999,5803,2005,5803,5803]
[618,"Business & Management","ECONOMICS","Economics",157.63006419999999,5471,2006,5471,5471]
[619,"Business & Management","ECONOMICS","Economics",158.02310230000001,4857,2007,4857,4857]
[620,"Business & Management","ECONOMICS","Economics",158.2454955,4452,2008,4452,4452]
[621,"Business & Management","ECONOMICS","Economics",158.47682280000001,4154,2009,4154,4154]
[622,"Business & Management","ECONOMICS","Economics",158.7312852,4636,2010,4636,4636]
[623,"Business & Management","ECONOMICS","Economics",159.1786271,5147,2011,5147,5147]
[624,"Business & Management","ECONOMICS","Economics",158.83170569999999,4422,2012,4422,4422]
[625,"Business & Management","ECONOMICS","Economics",159.0155426,3617,2013,3617,{"$f":"VLOOKUP(D962&G962,$M$2:$P$436,4)","v":3617}]
[626,"Business & Management","ECONOMICS","Economics",158.68972460000001,3031,2014,3031,3031]
[627,"Business & Management","ECONOMICS","Economics",158.9946352,2842,2015,2842,2842]
[628,"Business & Management","ECONOMICS","Economics",158.84336450000001,2717,2016,2717,2717]
[629,"Social Sciences & Helping Professions","EDUCATION, GENERAL","Education (primary, secondary)/Family relations",147.0507246,281,2002,1111,1111]
[644,"Social Sciences & Helping Professions","EDUCATION/ADMINISTRATION","Education (primary, secondary)/Family relations",143.3529412,17,2002,1111,1111]
[659,"Social Sciences & Helping Professions","EDUCATIONAL PSYCHOLOGY","Education (primary, secondary)/Family relations",146,14,2002,1111,1111]
[674,"Social Sciences & Helping Professions","ELEMENTARY EDUCATION","Education (primary, secondary)/Family relations",148.2658228,319,2002,1111,1111]
[734,"Social Sciences & Helping Professions","FAMILY RELATIONS/CHILD DEVELOPMENT","Education (primary, secondary)/Family relations",150.43333329999999,122,2002,1111,1111]
[902,"Social Sciences & Helping Professions","GUIDANCE/COUNSELING","Education (primary, secondary)/Family relations",140.72727269999999,12,2002,1111,1111]
[962,"Arts & Humanities","HOME ECONOMICS","Education (primary, secondary)/Family relations",147.56521739999999,23,2002,1111,1111]
[1191,"Arts & Humanities","LIBRARY STUDIES","Education (primary, secondary)/Family relations",145,25,2002,1111,1111]
[1746,"Social Sciences & Helping Professions","SECONDARY EDUCATION","Education (primary, secondary)/Family relations",149.73839659999999,238,2002,1111,1111]
[1822,"Social Sciences & Helping Professions","SPECIAL ED/DISABILITIES/HANDICAPPED","Education (primary, secondary)/Family relations",145.53448280000001,60,2002,1111,1111]
[630,"Social Sciences & Helping Professions","EDUCATION, GENERAL","Education (primary, secondary)/Family relations",148.8768657,275,2003,1136,1136]
[645,"Social Sciences & Helping Professions","EDUCATION/ADMINISTRATION","Education (primary, secondary)/Family relations",141.7333333,17,2003,1136,1136]
[660,"Social Sciences & Helping Professions","EDUCATIONAL PSYCHOLOGY","Education (primary, secondary)/Family relations",142.16666670000001,12,2003,1136,1136]
[675,"Social Sciences & Helping Professions","ELEMENTARY EDUCATION","Education (primary, secondary)/Family relations",147.92634559999999,353,2003,1136,1136]
[735,"Social Sciences & Helping Professions","FAMILY RELATIONS/CHILD DEVELOPMENT","Education (primary, secondary)/Family relations",152.44444440000001,117,2003,1136,1136]
[903,"Social Sciences & Helping Professions","GUIDANCE/COUNSELING","Education (primary, secondary)/Family relations",144.83333329999999,18,2003,1136,1136]
[963,"Arts & Humanities","HOME ECONOMICS","Education (primary, secondary)/Family relations",145.68421050000001,19,2003,1136,1136]
[1192,"Arts & Humanities","LIBRARY STUDIES","Education (primary, secondary)/Family relations",142.82352940000001,17,2003,1136,1136]
[1747,"Social Sciences & Helping Professions","SECONDARY EDUCATION","Education (primary, secondary)/Family relations",149.40416669999999,245,2003,1136,1136]
[1823,"Social Sciences & Helping Professions","SPECIAL ED/DISABILITIES/HANDICAPPED","Education (primary, secondary)/Family relations",147.2539683,63,2003,1136,1136]
[264,"Social Sciences & Helping Professions","BILINGUAL EDUCATION","Education (primary, secondary)/Family relations",145,8,2004,1135,1135]
[631,"Social Sciences & Helping Professions","EDUCATION, GENERAL","Education (primary, secondary)/Family relations",149.74031009999999,263,2004,1135,1135]
[646,"Social Sciences & Helping Professions","EDUCATION/ADMINISTRATION","Education (primary, secondary)/Family relations",147.91666670000001,12,2004,1135,1135]
[661,"Social Sciences & Helping Professions","EDUCATIONAL PSYCHOLOGY","Education (primary, secondary)/Family relations",148.4375,16,2004,1135,1135]
[676,"Social Sciences & Helping Professions","ELEMENTARY EDUCATION","Education (primary, secondary)/Family relations",148.41584159999999,306,2004,1135,1135]
[736,"Social Sciences & Helping Professions","FAMILY RELATIONS/CHILD DEVELOPMENT","Education (primary, secondary)/Family relations",151.21710529999999,152,2004,1135,1135]
[904,"Social Sciences & Helping Professions","GUIDANCE/COUNSELING","Education (primary, secondary)/Family relations",146.2857143,21,2004,1135,1135]
[964,"Arts & Humanities","HOME ECONOMICS","Education (primary, secondary)/Family relations",149,14,2004,1135,1135]
[1193,"Arts & Humanities","LIBRARY STUDIES","Education (primary, secondary)/Family relations",145,25,2004,1135,1135]
[1748,"Social Sciences & Helping Professions","SECONDARY EDUCATION","Education (primary, secondary)/Family relations",150.63095240000001,254,2004,1135,1135]
[1824,"Social Sciences & Helping Professions","SPECIAL ED/DISABILITIES/HANDICAPPED","Education (primary, secondary)/Family relations",146.90476190000001,64,2004,1135,1135]
[265,"Social Sciences & Helping Professions","BILINGUAL EDUCATION","Education (primary, secondary)/Family relations",151,7,2005,1084,1084]
[632,"Social Sciences & Helping Professions","EDUCATION, GENERAL","Education (primary, secondary)/Family relations",149.4723247,276,2005,1084,1084]
[647,"Social Sciences & Helping Professions","EDUCATION/ADMINISTRATION","Education (primary, secondary)/Family relations",144.375,17,2005,1084,1084]
[662,"Social Sciences & Helping Professions","EDUCATIONAL PSYCHOLOGY","Education (primary, secondary)/Family relations",153,11,2005,1084,1084]
[677,"Social Sciences & Helping Professions","ELEMENTARY EDUCATION","Education (primary, secondary)/Family relations",148.68773229999999,271,2005,1084,1084]
[737,"Social Sciences & Helping Professions","FAMILY RELATIONS/CHILD DEVELOPMENT","Education (primary, secondary)/Family relations",150.54285709999999,143,2005,1084,1084]
[905,"Social Sciences & Helping Professions","GUIDANCE/COUNSELING","Education (primary, secondary)/Family relations",143.54545450000001,12,2005,1084,1084]
[965,"Arts & Humanities","HOME ECONOMICS","Education (primary, secondary)/Family relations",148.48387099999999,31,2005,1084,1084]
[1194,"Arts & Humanities","LIBRARY STUDIES","Education (primary, secondary)/Family relations",147.14285709999999,21,2005,1084,1084]
[1749,"Social Sciences & Helping Professions","SECONDARY EDUCATION","Education (primary, secondary)/Family relations",151.12448130000001,241,2005,1084,1084]
[1825,"Social Sciences & Helping Professions","SPECIAL ED/DISABILITIES/HANDICAPPED","Education (primary, secondary)/Family relations",149.54901960000001,54,2005,1084,1084]
[266,"Social Sciences & Helping Professions","BILINGUAL EDUCATION","Education (primary, secondary)/Family relations",154.44444440000001,9,2006,1020,1020]
[633,"Social Sciences & Helping Professions","EDUCATION, GENERAL","Education (primary, secondary)/Family relations",148.50541519999999,280,2006,1020,1020]
[648,"Social Sciences & Helping Professions","EDUCATION/ADMINISTRATION","Education (primary, secondary)/Family relations",145.5,24,2006,1020,1020]
[663,"Social Sciences & Helping Professions","EDUCATIONAL PSYCHOLOGY","Education (primary, secondary)/Family relations",148.69230769999999,13,2006,1020,1020]
[678,"Social Sciences & Helping Professions","ELEMENTARY EDUCATION","Education (primary, secondary)/Family relations",149.49751240000001,202,2006,1020,1020]
[738,"Social Sciences & Helping Professions","FAMILY RELATIONS/CHILD DEVELOPMENT","Education (primary, secondary)/Family relations",151.56944440000001,146,2006,1020,1020]
[906,"Social Sciences & Helping Professions","GUIDANCE/COUNSELING","Education (primary, secondary)/Family relations",141.92307690000001,13,2006,1020,1020]
[966,"Arts & Humanities","HOME ECONOMICS","Education (primary, secondary)/Family relations",151.72727269999999,22,2006,1020,1020]
[1195,"Arts & Humanities","LIBRARY STUDIES","Education (primary, secondary)/Family relations",148.0625,33,2006,1020,1020]
[1750,"Social Sciences & Helping Professions","SECONDARY EDUCATION","Education (primary, secondary)/Family relations",150.76958529999999,220,2006,1020,1020]
[1826,"Social Sciences & Helping Professions","SPECIAL ED/DISABILITIES/HANDICAPPED","Education (primary, secondary)/Family relations",150.10714290000001,58,2006,1020,1020]
[267,"Social Sciences & Helping Professions","BILINGUAL EDUCATION","Education (primary, secondary)/Family relations",145.83333329999999,6,2007,888,888]
[634,"Social Sciences & Helping Professions","EDUCATION, GENERAL","Education (primary, secondary)/Family relations",148.6444444,275,2007,888,888]
[649,"Social Sciences & Helping Professions","EDUCATION/ADMINISTRATION","Education (primary, secondary)/Family relations",143,11,2007,888,888]
[664,"Social Sciences & Helping Professions","EDUCATIONAL PSYCHOLOGY","Education (primary, secondary)/Family relations",151.85714290000001,7,2007,888,888]
[679,"Social Sciences & Helping Professions","ELEMENTARY EDUCATION","Education (primary, secondary)/Family relations",148.77837840000001,189,2007,888,888]
[739,"Social Sciences & Helping Professions","FAMILY RELATIONS/CHILD DEVELOPMENT","Education (primary, secondary)/Family relations",150.17241379999999,116,2007,888,888]
[907,"Social Sciences & Helping Professions","GUIDANCE/COUNSELING","Education (primary, secondary)/Family relations",142.4,11,2007,888,888]
[967,"Arts & Humanities","HOME ECONOMICS","Education (primary, secondary)/Family relations",151.2105263,19,2007,888,{"$f":"VLOOKUP(D1026&G1026,$M$2:$P$436,4)","v":888}]
[1196,"Arts & Humanities","LIBRARY STUDIES","Education (primary, secondary)/Family relations",146.10714290000001,28,2007,888,888]
[1751,"Social Sciences & Helping Professions","SECONDARY EDUCATION","Education (primary, secondary)/Family relations",151.625731,176,2007,888,888]
[1827,"Social Sciences & Helping Professions","SPECIAL ED/DISABILITIES/HANDICAPPED","Education (primary, secondary)/Family relations",149.97999999999999,50,2007,888,888]
[268,"Social Sciences & Helping Professions","BILINGUAL EDUCATION","Education (primary, secondary)/Family relations",145.57142859999999,7,2008,810,810]
[635,"Social Sciences & Helping Professions","EDUCATION, GENERAL","Education (primary, secondary)/Family relations",149.71806169999999,233,2008,810,810]
[650,"Social Sciences & Helping Professions","EDUCATION/ADMINISTRATION","Education (primary, secondary)/Family relations",144.75,12,2008,810,810]
[665,"Social Sciences & Helping Professions","EDUCATIONAL PSYCHOLOGY","Education (primary, secondary)/Family relations",151.55555559999999,9,2008,810,810]
[680,"Social Sciences & Helping Professions","ELEMENTARY EDUCATION","Education (primary, secondary)/Family relations",148.55974839999999,165,2008,810,810]
[740,"Social Sciences & Helping Professions","FAMILY RELATIONS/CHILD DEVELOPMENT","Education (primary, secondary)/Family relations",151.0650407,126,2008,810,810]
[908,"Social Sciences & Helping Professions","GUIDANCE/COUNSELING","Education (primary, secondary)/Family relations",137.6,6,2008,810,810]
[968,"Arts & Humanities","HOME ECONOMICS","Education (primary, secondary)/Family relations",154,12,2008,810,810]
[1197,"Arts & Humanities","LIBRARY STUDIES","Education (primary, secondary)/Family relations",144.0625,16,2008,810,810]
[1752,"Social Sciences & Helping Professions","SECONDARY EDUCATION","Education (primary, secondary)/Family relations",152.58241760000001,184,2008,810,810]
[1828,"Social Sciences & Helping Professions","SPECIAL ED/DISABILITIES/HANDICAPPED","Education (primary, secondary)/Family relations",148.7105263,40,2008,810,810]
[269,"Social Sciences & Helping Professions","BILINGUAL EDUCATION","Education (primary, secondary)/Family relations",149.16666670000001,6,2009,787,787]
[636,"Social Sciences & Helping Professions","EDUCATION, GENERAL","Education (primary, secondary)/Family relations",150.84162900000001,224,2009,787,787]
[651,"Social Sciences & Helping Professions","EDUCATION/ADMINISTRATION","Education (primary, secondary)/Family relations",144.75,16,2009,787,787]
[666,"Social Sciences & Helping Professions","EDUCATIONAL PSYCHOLOGY","Education (primary, secondary)/Family relations",153,5,2009,787,787]
[681,"Social Sciences & Helping Professions","ELEMENTARY EDUCATION","Education (primary, secondary)/Family relations",149.537037,165,2009,787,787]
[741,"Social Sciences & Helping Professions","FAMILY RELATIONS/CHILD DEVELOPMENT","Education (primary, secondary)/Family relations",150.47200000000001,127,2009,787,787]
[909,"Social Sciences & Helping Professions","GUIDANCE/COUNSELING","Education (primary, secondary)/Family relations",142.69230769999999,13,2009,787,787]
[969,"Arts & Humanities","HOME ECONOMICS","Education (primary, secondary)/Family relations",151.19999999999999,10,2009,787,787]
[1198,"Arts & Humanities","LIBRARY STUDIES","Education (primary, secondary)/Family relations",144.7619048,21,2009,787,787]
[1753,"Social Sciences & Helping Professions","SECONDARY EDUCATION","Education (primary, secondary)/Family relations",153.4965986,148,2009,787,787]
[1829,"Social Sciences & Helping Professions","SPECIAL ED/DISABILITIES/HANDICAPPED","Education (primary, secondary)/Family relations",149.04,52,2009,787,787]
[270,"Social Sciences & Helping Professions","BILINGUAL EDUCATION","Education (primary, secondary)/Family relations",146.80000000000001,10,2010,752,752]
[637,"Social Sciences & Helping Professions","EDUCATION, GENERAL","Education (primary, secondary)/Family relations",150.480198,205,2010,752,752]
[652,"Social Sciences & Helping Professions","EDUCATION/ADMINISTRATION","Education (primary, secondary)/Family relations",142.5,12,2010,752,752]
[667,"Social Sciences & Helping Professions","EDUCATIONAL PSYCHOLOGY","Education (primary, secondary)/Family relations",144,5,2010,752,752]
[682,"Social Sciences & Helping Professions","ELEMENTARY EDUCATION","Education (primary, secondary)/Family relations",150.18115940000001,139,2010,752,752]
[742,"Social Sciences & Helping Professions","FAMILY RELATIONS/CHILD DEVELOPMENT","Education (primary, secondary)/Family relations",149.1707317,124,2010,752,752]
[910,"Social Sciences & Helping Professions","GUIDANCE/COUNSELING","Education (primary, secondary)/Family relations",147.08333329999999,12,2010,752,752]
[970,"Arts & Humanities","HOME ECONOMICS","Education (primary, secondary)/Family relations",150.88888890000001,10,2010,752,752]
[1199,"Arts & Humanities","LIBRARY STUDIES","Education (primary, secondary)/Family relations",146.42857140000001,28,2010,752,752]
[1754,"Social Sciences & Helping Professions","SECONDARY EDUCATION","Education (primary, secondary)/Family relations",152.14525140000001,180,2010,752,752]
[1830,"Social Sciences & Helping Professions","SPECIAL ED/DISABILITIES/HANDICAPPED","Education (primary, secondary)/Family relations",146.30769230000001,27,2010,752,752]
[271,"Social Sciences & Helping Professions","BILINGUAL EDUCATION","Education (primary, secondary)/Family relations",150.19999999999999,10,2011,755,755]
[638,"Social Sciences & Helping Professions","EDUCATION, GENERAL","Education (primary, secondary)/Family relations",150.85915489999999,215,2011,755,755]
[653,"Social Sciences & Helping Professions","EDUCATION/ADMINISTRATION","Education (primary, secondary)/Family relations",145.2222222,9,2011,755,755]
[668,"Social Sciences & Helping Professions","EDUCATIONAL PSYCHOLOGY","Education (primary, secondary)/Family relations",147.5,10,2011,755,755]
[683,"Social Sciences & Helping Professions","ELEMENTARY EDUCATION","Education (primary, secondary)/Family relations",151.12765959999999,145,2011,755,755]
[743,"Social Sciences & Helping Professions","FAMILY RELATIONS/CHILD DEVELOPMENT","Education (primary, secondary)/Family relations",150.648855,131,2011,755,755]
[911,"Social Sciences & Helping Professions","GUIDANCE/COUNSELING","Education (primary, secondary)/Family relations",141.2307692,13,2011,755,755]
[971,"Arts & Humanities","HOME ECONOMICS","Education (primary, secondary)/Family relations",149.08333329999999,12,2011,755,755]
[1200,"Arts & Humanities","LIBRARY STUDIES","Education (primary, secondary)/Family relations",146.94999999999999,20,2011,755,755]
[1755,"Social Sciences & Helping Professions","SECONDARY EDUCATION","Education (primary, secondary)/Family relations",151.65432100000001,162,2011,755,755]
[1831,"Social Sciences & Helping Professions","SPECIAL ED/DISABILITIES/HANDICAPPED","Education (primary, secondary)/Family relations",150.2592593,28,2011,755,755]
[272,"Social Sciences & Helping Professions","BILINGUAL EDUCATION","Education (primary, secondary)/Family relations",147.44444440000001,9,2012,738,738]
[639,"Social Sciences & Helping Professions","EDUCATION, GENERAL","Education (primary, secondary)/Family relations",151.31081080000001,228,2012,738,738]
[654,"Social Sciences & Helping Professions","EDUCATION/ADMINISTRATION","Education (primary, secondary)/Family relations",137.2857143,7,2012,738,738]
[669,"Social Sciences & Helping Professions","EDUCATIONAL PSYCHOLOGY","Education (primary, secondary)/Family relations",147.36363639999999,11,2012,738,738]
[684,"Social Sciences & Helping Professions","ELEMENTARY EDUCATION","Education (primary, secondary)/Family relations",150.31451609999999,126,2012,738,738]
[744,"Social Sciences & Helping Professions","FAMILY RELATIONS/CHILD DEVELOPMENT","Education (primary, secondary)/Family relations",150.5619835,123,2012,738,738]
[912,"Social Sciences & Helping Professions","GUIDANCE/COUNSELING","Education (primary, secondary)/Family relations",141.33333329999999,12,2012,738,738]
[972,"Arts & Humanities","HOME ECONOMICS","Education (primary, secondary)/Family relations",152.6,5,2012,738,738]
[1201,"Arts & Humanities","LIBRARY STUDIES","Education (primary, secondary)/Family relations",146.6,20,2012,738,738]
[1756,"Social Sciences & Helping Professions","SECONDARY EDUCATION","Education (primary, secondary)/Family relations",152.0308642,162,2012,738,738]
[1832,"Social Sciences & Helping Professions","SPECIAL ED/DISABILITIES/HANDICAPPED","Education (primary, secondary)/Family relations",150.22857139999999,35,2012,738,738]
[640,"Social Sciences & Helping Professions","EDUCATION, GENERAL","Education (primary, secondary)/Family relations",151.15348839999999,219,2013,657,657]
[655,"Social Sciences & Helping Professions","EDUCATION/ADMINISTRATION","Education (primary, secondary)/Family relations",145.5,10,2013,657,657]
[670,"Social Sciences & Helping Professions","EDUCATIONAL PSYCHOLOGY","Education (primary, secondary)/Family relations",147.80000000000001,5,2013,657,657]
[685,"Social Sciences & Helping Professions","ELEMENTARY EDUCATION","Education (primary, secondary)/Family relations",149.41176469999999,122,2013,657,657]
[745,"Social Sciences & Helping Professions","FAMILY RELATIONS/CHILD DEVELOPMENT","Education (primary, secondary)/Family relations",150.89814809999999,108,2013,657,657]
[913,"Social Sciences & Helping Professions","GUIDANCE/COUNSELING","Education (primary, secondary)/Family relations",140.18181820000001,11,2013,657,{"$f":"VLOOKUP(D1090&G1090,$M$2:$P$436,4)","v":657}]
[973,"Arts & Humanities","HOME ECONOMICS","Education (primary, secondary)/Family relations",148.3846154,13,2013,657,657]
[1202,"Arts & Humanities","LIBRARY STUDIES","Education (primary, secondary)/Family relations",152.44999999999999,20,2013,657,657]
[1757,"Social Sciences & Helping Professions","SECONDARY EDUCATION","Education (primary, secondary)/Family relations",154.19819820000001,111,2013,657,657]
[1833,"Social Sciences & Helping Professions","SPECIAL ED/DISABILITIES/HANDICAPPED","Education (primary, secondary)/Family relations",149.6756757,38,2013,657,657]
[273,"Social Sciences & Helping Professions","BILINGUAL EDUCATION","Education (primary, secondary)/Family relations",145.5,8,2014,562,562]
[641,"Social Sciences & Helping Professions","EDUCATION, GENERAL","Education (primary, secondary)/Family relations",149.33918130000001,175,2014,562,562]
[656,"Social Sciences & Helping Professions","EDUCATION/ADMINISTRATION","Education (primary, secondary)/Family relations",142.42857140000001,7,2014,562,562]
[671,"Social Sciences & Helping Professions","EDUCATIONAL PSYCHOLOGY","Education (primary, secondary)/Family relations",148.42857140000001,7,2014,562,562]
[686,"Social Sciences & Helping Professions","ELEMENTARY EDUCATION","Education (primary, secondary)/Family relations",148.40425529999999,96,2014,562,562]
[746,"Social Sciences & Helping Professions","FAMILY RELATIONS/CHILD DEVELOPMENT","Education (primary, secondary)/Family relations",152.33684210000001,98,2014,562,562]
[914,"Social Sciences & Helping Professions","GUIDANCE/COUNSELING","Education (primary, secondary)/Family relations",137.36363639999999,14,2014,562,562]
[974,"Arts & Humanities","HOME ECONOMICS","Education (primary, secondary)/Family relations",148.33333329999999,6,2014,562,562]
[1203,"Arts & Humanities","LIBRARY STUDIES","Education (primary, secondary)/Family relations",148.68181820000001,23,2014,562,562]
[1758,"Social Sciences & Helping Professions","SECONDARY EDUCATION","Education (primary, secondary)/Family relations",152.6442308,105,2014,562,562]
[1834,"Social Sciences & Helping Professions","SPECIAL ED/DISABILITIES/HANDICAPPED","Education (primary, secondary)/Family relations",147.77272730000001,23,2014,562,562]
[642,"Social Sciences & Helping Professions","EDUCATION, GENERAL","Education (primary, secondary)/Family relations",151.2896552,148,2015,497,497]
[657,"Social Sciences & Helping Professions","EDUCATION/ADMINISTRATION","Education (primary, secondary)/Family relations",142.57142859999999,8,2015,497,497]
[672,"Social Sciences & Helping Professions","EDUCATIONAL PSYCHOLOGY","Education (primary, secondary)/Family relations",150.80000000000001,6,2015,497,497]
[687,"Social Sciences & Helping Professions","ELEMENTARY EDUCATION","Education (primary, secondary)/Family relations",147.816092,88,2015,497,497]
[747,"Social Sciences & Helping Professions","FAMILY RELATIONS/CHILD DEVELOPMENT","Education (primary, secondary)/Family relations",149.0277778,109,2015,497,497]
[915,"Social Sciences & Helping Professions","GUIDANCE/COUNSELING","Education (primary, secondary)/Family relations",142.18181820000001,13,2015,497,497]
[1204,"Arts & Humanities","LIBRARY STUDIES","Education (primary, secondary)/Family relations",143.8947368,22,2015,497,497]
[1759,"Social Sciences & Helping Professions","SECONDARY EDUCATION","Education (primary, secondary)/Family relations",153.0361446,85,2015,497,497]
[1835,"Social Sciences & Helping Professions","SPECIAL ED/DISABILITIES/HANDICAPPED","Education (primary, secondary)/Family relations",147.94444440000001,18,2015,497,497]
[643,"Social Sciences & Helping Professions","EDUCATION, GENERAL","Education (primary, secondary)/Family relations",150.54794519999999,149,2016,517,517]
[658,"Social Sciences & Helping Professions","EDUCATION/ADMINISTRATION","Education (primary, secondary)/Family relations",146.4,10,2016,517,517]
[673,"Social Sciences & Helping Professions","EDUCATIONAL PSYCHOLOGY","Education (primary, secondary)/Family relations",154.42857140000001,8,2016,517,517]
[688,"Social Sciences & Helping Professions","ELEMENTARY EDUCATION","Education (primary, secondary)/Family relations",148.70833329999999,98,2016,517,517]
[748,"Social Sciences & Helping Professions","FAMILY RELATIONS/CHILD DEVELOPMENT","Education (primary, secondary)/Family relations",150.60377360000001,109,2016,517,517]
[916,"Social Sciences & Helping Professions","GUIDANCE/COUNSELING","Education (primary, secondary)/Family relations",139.7142857,7,2016,517,517]
[975,"Arts & Humanities","HOME ECONOMICS","Education (primary, secondary)/Family relations",146.30000000000001,10,2016,517,517]
[1205,"Arts & Humanities","LIBRARY STUDIES","Education (primary, secondary)/Family relations",145.2777778,20,2016,517,517]
[1760,"Social Sciences & Helping Professions","SECONDARY EDUCATION","Education (primary, secondary)/Family relations",151.5,87,2016,517,517]
[1836,"Social Sciences & Helping Professions","SPECIAL ED/DISABILITIES/HANDICAPPED","Education (primary, secondary)/Family relations",150.52631579999999,19,2016,517,517]
[689,"Engineering","Engineering","Engineering",154.5641516,2039,2002,2039,2039]
[690,"Engineering","Engineering","Engineering",155.26726260000001,2937,2003,2937,2937]
[691,"Engineering","Engineering","Engineering",155.95355960000001,3479,2004,3479,3479]
[692,"Engineering","Engineering","Engineering",156.34023719999999,3650,2005,3650,3650]
[693,"Engineering","Engineering","Engineering",156.8568731,3328,2006,3328,3328]
[694,"Engineering","Engineering","Engineering",156.85633569999999,2810,2007,2810,2810]
[695,"Engineering","Engineering","Engineering",157.08231710000001,2463,2008,2463,2463]
[696,"Engineering","Engineering","Engineering",156.9824849,2403,2009,2403,2403]
[697,"Engineering","Engineering","Engineering",157.23188440000001,2307,2010,2307,2307]
[698,"Engineering","Engineering","Engineering",157.13198610000001,2209,2011,2209,2209]
[699,"Engineering","Engineering","Engineering",157.16440030000001,1707,2012,1707,1707]
[700,"Engineering","Engineering","Engineering",157.08363370000001,1304,2013,1304,1304]
[701,"Engineering","Engineering","Engineering",156.61025789999999,1103,2014,1103,1103]
[702,"Engineering","Engineering","Engineering",156.8437284,958,2015,958,958]
[703,"Engineering","Engineering","Engineering",156.52203610000001,952,2016,952,952]
[464,"Arts & Humanities","CLASSICS","English/Classics/Literature/Lingusitics",158.7908745,264,2002,6674,6674]
[704,"Arts & Humanities","ENGLISH","English/Classics/Literature/Lingusitics",154.13369349999999,5949,2002,6674,6674]
[1206,"Arts & Humanities","LINGUISTICS","English/Classics/Literature/Lingusitics",158.83783779999999,75,2002,6674,6674]
[1221,"Arts & Humanities","LITERATURE","English/Classics/Literature/Lingusitics",155.8883117,386,2002,6674,6674]
[465,"Arts & Humanities","CLASSICS","English/Classics/Literature/Lingusitics",158.7232472,271,2003,7691,7691]
[705,"Arts & Humanities","ENGLISH","English/Classics/Literature/Lingusitics",154.54326359999999,6917,2003,7691,7691]
[1207,"Arts & Humanities","LINGUISTICS","English/Classics/Literature/Lingusitics",158.75257730000001,97,2003,7691,7691]
[1222,"Arts & Humanities","LITERATURE","English/Classics/Literature/Lingusitics",155.42928040000001,406,2003,7691,7691]
[466,"Arts & Humanities","CLASSICS","English/Classics/Literature/Lingusitics",158.54571429999999,350,2004,8220,8220]
[706,"Arts & Humanities","ENGLISH","English/Classics/Literature/Lingusitics",154.76421980000001,7290,2004,8220,8220]
[1208,"Arts & Humanities","LINGUISTICS","English/Classics/Literature/Lingusitics",157.73043480000001,116,2004,8220,8220]
[1223,"Arts & Humanities","LITERATURE","English/Classics/Literature/Lingusitics",156.64578829999999,464,2004,8220,8220]
[467,"Arts & Humanities","CLASSICS","English/Classics/Literature/Lingusitics",159.19543150000001,394,2005,8231,8231]
[707,"Arts & Humanities","ENGLISH","English/Classics/Literature/Lingusitics",154.83647970000001,7229,2005,8231,8231]
[1209,"Arts & Humanities","LINGUISTICS","English/Classics/Literature/Lingusitics",160.1796875,128,2005,8231,{"$f":"VLOOKUP(D1154&G1154,$M$2:$P$436,4)","v":8231}]
[1224,"Arts & Humanities","LITERATURE","English/Classics/Literature/Lingusitics",156.43125000000001,480,2005,8231,8231]
[468,"Arts & Humanities","CLASSICS","English/Classics/Literature/Lingusitics",159.3810742,391,2006,7964,7964]
[708,"Arts & Humanities","ENGLISH","English/Classics/Literature/Lingusitics",155.2074053,6947,2006,7964,7964]
[1210,"Arts & Humanities","LINGUISTICS","English/Classics/Literature/Lingusitics",160.45669290000001,127,2006,7964,7964]
[1225,"Arts & Humanities","LITERATURE","English/Classics/Literature/Lingusitics",156.56740439999999,499,2006,7964,7964]
[469,"Arts & Humanities","CLASSICS","English/Classics/Literature/Lingusitics",159.22857139999999,386,2007,7547,7547]
[709,"Arts & Humanities","ENGLISH","English/Classics/Literature/Lingusitics",155.2518757,6552,2007,7547,7547]
[1211,"Arts & Humanities","LINGUISTICS","English/Classics/Literature/Lingusitics",158.71111110000001,135,2007,7547,7547]
[1226,"Arts & Humanities","LITERATURE","English/Classics/Literature/Lingusitics",156.86892180000001,474,2007,7547,7547]
[470,"Arts & Humanities","CLASSICS","English/Classics/Literature/Lingusitics",159.7338129,417,2008,7347,7347]
[710,"Arts & Humanities","ENGLISH","English/Classics/Literature/Lingusitics",155.42466189999999,6309,2008,7347,7347]
[1212,"Arts & Humanities","LINGUISTICS","English/Classics/Literature/Lingusitics",159.89506170000001,162,2008,7347,7347]
[1227,"Arts & Humanities","LITERATURE","English/Classics/Literature/Lingusitics",157.3654267,459,2008,7347,7347]
[471,"Arts & Humanities","CLASSICS","English/Classics/Literature/Lingusitics",159.89603959999999,405,2009,7209,7209]
[711,"Arts & Humanities","ENGLISH","English/Classics/Literature/Lingusitics",155.3581092,6154,2009,7209,7209]
[1213,"Arts & Humanities","LINGUISTICS","English/Classics/Literature/Lingusitics",160.17469879999999,166,2009,7209,7209]
[1228,"Arts & Humanities","LITERATURE","English/Classics/Literature/Lingusitics",157.55625000000001,484,2009,7209,7209]
[472,"Arts & Humanities","CLASSICS","English/Classics/Literature/Lingusitics",160.74610240000001,449,2010,7189,7189]
[712,"Arts & Humanities","ENGLISH","English/Classics/Literature/Lingusitics",155.59402689999999,6105,2010,7189,7189]
[1214,"Arts & Humanities","LINGUISTICS","English/Classics/Literature/Lingusitics",160.41290319999999,155,2010,7189,7189]
[1229,"Arts & Humanities","LITERATURE","English/Classics/Literature/Lingusitics",156.894958,480,2010,7189,7189]
[473,"Arts & Humanities","CLASSICS","English/Classics/Literature/Lingusitics",161.11428570000001,455,2011,7240,7240]
[713,"Arts & Humanities","ENGLISH","English/Classics/Literature/Lingusitics",156.21468189999999,6144,2011,7240,7240]
[1215,"Arts & Humanities","LINGUISTICS","English/Classics/Literature/Lingusitics",159.9251337,189,2011,7240,7240]
[1230,"Arts & Humanities","LITERATURE","English/Classics/Literature/Lingusitics",157.63192900000001,452,2011,7240,7240]
[474,"Arts & Humanities","CLASSICS","English/Classics/Literature/Lingusitics",160.73945409999999,403,2012,6473,6473]
[714,"Arts & Humanities","ENGLISH","English/Classics/Literature/Lingusitics",155.93050969999999,5475,2012,6473,6473]
[1216,"Arts & Humanities","LINGUISTICS","English/Classics/Literature/Lingusitics",160.48947369999999,190,2012,6473,6473]
[1231,"Arts & Humanities","LITERATURE","English/Classics/Literature/Lingusitics",158.0518519,405,2012,6473,6473]
[475,"Arts & Humanities","CLASSICS","English/Classics/Literature/Lingusitics",160.71018280000001,383,2013,5563,5563]
[715,"Arts & Humanities","ENGLISH","English/Classics/Literature/Lingusitics",155.57825439999999,4722,2013,5563,5563]
[1217,"Arts & Humanities","LINGUISTICS","English/Classics/Literature/Lingusitics",160.05511809999999,127,2013,5563,5563]
[1232,"Arts & Humanities","LITERATURE","English/Classics/Literature/Lingusitics",157.7636364,331,2013,5563,5563]
[476,"Arts & Humanities","CLASSICS","English/Classics/Literature/Lingusitics",160.2741935,311,2014,4796,4796]
[716,"Arts & Humanities","ENGLISH","English/Classics/Literature/Lingusitics",154.78330020000001,4076,2014,4796,4796]
[1218,"Arts & Humanities","LINGUISTICS","English/Classics/Literature/Lingusitics",159.96774189999999,124,2014,4796,4796]
[1233,"Arts & Humanities","LITERATURE","English/Classics/Literature/Lingusitics",156.89891700000001,285,2014,4796,4796]
[477,"Arts & Humanities","CLASSICS","English/Classics/Literature/Lingusitics",160.44520549999999,292,2015,4390,4390]
[717,"Arts & Humanities","ENGLISH","English/Classics/Literature/Lingusitics",154.91417709999999,3732,2015,4390,4390]
[1219,"Arts & Humanities","LINGUISTICS","English/Classics/Literature/Lingusitics",160.7142857,121,2015,4390,4390]
[1234,"Arts & Humanities","LITERATURE","English/Classics/Literature/Lingusitics",156.0702479,245,2015,4390,4390]
[478,"Arts & Humanities","CLASSICS","English/Classics/Literature/Lingusitics",160.86971829999999,286,2016,4195,4195]
[718,"Arts & Humanities","ENGLISH","English/Classics/Literature/Lingusitics",154.36100769999999,3549,2016,4195,4195]
[1220,"Arts & Humanities","LINGUISTICS","English/Classics/Literature/Lingusitics",159.98319330000001,120,2016,4195,4195]
[1235,"Arts & Humanities","LITERATURE","English/Classics/Literature/Lingusitics",156.90794980000001,240,2016,4195,4195]
[764,"Business & Management","FINANCE","Finance & Insueance",152.36977060000001,2235,2002,2285,2285]
[1066,"Business & Management","INSURANCE AND RISK MANAGEMENT","Finance & Insueance",151.85714290000001,50,2002,2285,2285]
[765,"Business & Management","FINANCE","Finance & Insueance",152.90009699999999,3107,2003,3165,3165]
[1067,"Business & Management","INSURANCE AND RISK MANAGEMENT","Finance & Insueance",153.1551724,58,2003,3165,3165]
[766,"Business & Management","FINANCE","Finance & Insueance",153.16158609999999,4059,2004,4132,4132]
[1068,"Business & Management","INSURANCE AND RISK MANAGEMENT","Finance & Insueance",153.17808220000001,73,2004,4132,4132]
[767,"Business & Management","FINANCE","Finance & Insueance",153.43538390000001,4213,2005,4288,4288]
[1069,"Business & Management","INSURANCE AND RISK MANAGEMENT","Finance & Insueance",153.96,75,2005,4288,4288]
[768,"Business & Management","FINANCE","Finance & Insueance",153.74192679999999,3744,2006,3827,3827]
[1070,"Business & Management","INSURANCE AND RISK MANAGEMENT","Finance & Insueance",152.32530120000001,83,2006,3827,3827]
[769,"Business & Management","FINANCE","Finance & Insueance",153.94005709999999,3171,2007,3237,3237]
[1071,"Business & Management","INSURANCE AND RISK MANAGEMENT","Finance & Insueance",152.6153846,66,2007,3237,3237]
[770,"Business & Management","FINANCE","Finance & Insueance",153.9245019,2876,2008,2947,2947]
[1072,"Business & Management","INSURANCE AND RISK MANAGEMENT","Finance & Insueance",152.6760563,71,2008,2947,2947]
[771,"Business & Management","FINANCE","Finance & Insueance",154.08032729999999,2704,2009,2762,2762]
[1073,"Business & Management","INSURANCE AND RISK MANAGEMENT","Finance & Insueance",152.6140351,58,2009,2762,2762]
[772,"Business & Management","FINANCE","Finance & Insueance",154.36794789999999,3244,2010,3313,3313]
[1074,"Business & Management","INSURANCE AND RISK MANAGEMENT","Finance & Insueance",152.2318841,69,2010,3313,3313]
[773,"Business & Management","FINANCE","Finance & Insueance",154.8381583,3643,2011,3710,{"$f":"VLOOKUP(D1218&G1218,$M$2:$P$436,4)","v":3710}]
[1075,"Business & Management","INSURANCE AND RISK MANAGEMENT","Finance & Insueance",153.0298507,67,2011,3710,3710]
[774,"Business & Management","FINANCE","Finance & Insueance",154.53867030000001,2960,2012,3020,3020]
[1076,"Business & Management","INSURANCE AND RISK MANAGEMENT","Finance & Insueance",152.4915254,60,2012,3020,3020]
[775,"Business & Management","FINANCE","Finance & Insueance",154.50131350000001,2299,2013,2351,2351]
[1077,"Business & Management","INSURANCE AND RISK MANAGEMENT","Finance & Insueance",153.2692308,52,2013,2351,2351]
[776,"Business & Management","FINANCE","Finance & Insueance",153.954646,1842,2014,1891,1891]
[1078,"Business & Management","INSURANCE AND RISK MANAGEMENT","Finance & Insueance",153.125,49,2014,1891,1891]
[777,"Business & Management","FINANCE","Finance & Insueance",154.49054140000001,1575,2015,1601,1601]
[1079,"Business & Management","INSURANCE AND RISK MANAGEMENT","Finance & Insueance",154.30769230000001,26,2015,1601,1601]
[778,"Business & Management","FINANCE","Finance & Insueance",154.01047489999999,1468,2016,1510,1510]
[1080,"Business & Management","INSURANCE AND RISK MANAGEMENT","Finance & Insueance",155.56097560000001,42,2016,1510,1510]
[794,"Arts & Humanities","FOREIGN LANGUAGES","Foreign languages (Spanish, French, German, Russian)",153.8291815,281,2002,2272,2272]
[824,"Arts & Humanities","FRENCH","Foreign languages (Spanish, French, German, Russian)",154.50557620000001,543,2002,2272,2272]
[872,"Arts & Humanities","GERMAN","Foreign languages (Spanish, French, German, Russian)",156.4028777,278,2002,2272,2272]
[1716,"Arts & Humanities","RUSSIAN","Foreign languages (Spanish, French, German, Russian)",157.71333329999999,152,2002,2272,2272]
[1807,"Arts & Humanities","SPANISH","Foreign languages (Spanish, French, German, Russian)",152.69625250000001,1018,2002,2272,2272]
[795,"Arts & Humanities","FOREIGN LANGUAGES","Foreign languages (Spanish, French, German, Russian)",154.52842810000001,301,2003,2597,2597]
[825,"Arts & Humanities","FRENCH","Foreign languages (Spanish, French, German, Russian)",155.43645480000001,599,2003,2597,2597]
[873,"Arts & Humanities","GERMAN","Foreign languages (Spanish, French, German, Russian)",156.35087720000001,285,2003,2597,2597]
[1717,"Arts & Humanities","RUSSIAN","Foreign languages (Spanish, French, German, Russian)",157.72352939999999,170,2003,2597,2597]
[1808,"Arts & Humanities","SPANISH","Foreign languages (Spanish, French, German, Russian)",153.28167880000001,1242,2003,2597,2597]
[796,"Arts & Humanities","FOREIGN LANGUAGES","Foreign languages (Spanish, French, German, Russian)",154.3779193,472,2004,2991,2991]
[826,"Arts & Humanities","FRENCH","Foreign languages (Spanish, French, German, Russian)",155.50746269999999,672,2004,2991,2991]
[874,"Arts & Humanities","GERMAN","Foreign languages (Spanish, French, German, Russian)",156.79054049999999,296,2004,2991,2991]
[1718,"Arts & Humanities","RUSSIAN","Foreign languages (Spanish, French, German, Russian)",157.5757576,167,2004,2991,2991]
[1809,"Arts & Humanities","SPANISH","Foreign languages (Spanish, French, German, Russian)",153.80680169999999,1384,2004,2991,2991]
[797,"Arts & Humanities","FOREIGN LANGUAGES","Foreign languages (Spanish, French, German, Russian)",154.79456709999999,590,2005,3317,3317]
[827,"Arts & Humanities","FRENCH","Foreign languages (Spanish, French, German, Russian)",156.32102269999999,706,2005,3317,3317]
[875,"Arts & Humanities","GERMAN","Foreign languages (Spanish, French, German, Russian)",157.22807019999999,343,2005,3317,3317]
[1719,"Arts & Humanities","RUSSIAN","Foreign languages (Spanish, French, German, Russian)",159.2146893,178,2005,3317,3317]
[1810,"Arts & Humanities","SPANISH","Foreign languages (Spanish, French, German, Russian)",153.84836340000001,1500,2005,3317,3317]
[798,"Arts & Humanities","FOREIGN LANGUAGES","Foreign languages (Spanish, French, German, Russian)",154.77894739999999,572,2006,3291,3291]
[828,"Arts & Humanities","FRENCH","Foreign languages (Spanish, French, German, Russian)",156.6567608,677,2006,3291,3291]
[876,"Arts & Humanities","GERMAN","Foreign languages (Spanish, French, German, Russian)",156.88823529999999,342,2006,3291,3291]
[1720,"Arts & Humanities","RUSSIAN","Foreign languages (Spanish, French, German, Russian)",157.97395829999999,193,2006,3291,3291]
[1811,"Arts & Humanities","SPANISH","Foreign languages (Spanish, French, German, Russian)",154.53533329999999,1507,2006,3291,3291]
[799,"Arts & Humanities","FOREIGN LANGUAGES","Foreign languages (Spanish, French, German, Russian)",155.59399999999999,501,2007,3166,3166]
[829,"Arts & Humanities","FRENCH","Foreign languages (Spanish, French, German, Russian)",157.01594900000001,627,2007,3166,3166]
[877,"Arts & Humanities","GERMAN","Foreign languages (Spanish, French, German, Russian)",156.67820069999999,289,2007,3166,3166]
[1721,"Arts & Humanities","RUSSIAN","Foreign languages (Spanish, French, German, Russian)",158.52513970000001,179,2007,3166,3166]
[1812,"Arts & Humanities","SPANISH","Foreign languages (Spanish, French, German, Russian)",154.53870760000001,1570,2007,3166,3166]
[800,"Arts & Humanities","FOREIGN LANGUAGES","Foreign languages (Spanish, French, German, Russian)",156.45073379999999,479,2008,3185,3185]
[830,"Arts & Humanities","FRENCH","Foreign languages (Spanish, French, German, Russian)",156.78494620000001,653,2008,3185,3185]
[878,"Arts & Humanities","GERMAN","Foreign languages (Spanish, French, German, Russian)",157.06106869999999,262,2008,3185,3185]
[1722,"Arts & Humanities","RUSSIAN","Foreign languages (Spanish, French, German, Russian)",157.56707320000001,164,2008,3185,3185]
[1813,"Arts & Humanities","SPANISH","Foreign languages (Spanish, French, German, Russian)",154.97969230000001,1627,2008,3185,3185]
[801,"Arts & Humanities","FOREIGN LANGUAGES","Foreign languages (Spanish, French, German, Russian)",157.14953270000001,535,2009,3128,3128]
[831,"Arts & Humanities","FRENCH","Foreign languages (Spanish, French, German, Russian)",157.7503782,661,2009,3128,3128]
[879,"Arts & Humanities","GERMAN","Foreign languages (Spanish, French, German, Russian)",157.54771779999999,241,2009,3128,3128]
[1723,"Arts & Humanities","RUSSIAN","Foreign languages (Spanish, French, German, Russian)",158.54676259999999,139,2009,3128,3128]
[1814,"Arts & Humanities","SPANISH","Foreign languages (Spanish, French, German, Russian)",154.91994840000001,1552,2009,3128,3128]
[802,"Arts & Humanities","FOREIGN LANGUAGES","Foreign languages (Spanish, French, German, Russian)",157.05753970000001,506,2010,3222,3222]
[832,"Arts & Humanities","FRENCH","Foreign languages (Spanish, French, German, Russian)",157.28,600,2010,3222,3222]
[880,"Arts & Humanities","GERMAN","Foreign languages (Spanish, French, German, Russian)",157.58088240000001,273,2010,3222,3222]
[1724,"Arts & Humanities","RUSSIAN","Foreign languages (Spanish, French, German, Russian)",159.50359710000001,139,2010,3222,3222]
[1815,"Arts & Humanities","SPANISH","Foreign languages (Spanish, French, German, Russian)",154.994709,1704,2010,3222,3222]
[803,"Arts & Humanities","FOREIGN LANGUAGES","Foreign languages (Spanish, French, German, Russian)",157.85932199999999,591,2011,3436,3436]
[833,"Arts & Humanities","FRENCH","Foreign languages (Spanish, French, German, Russian)",157.796131,672,2011,3436,3436]
[881,"Arts & Humanities","GERMAN","Foreign languages (Spanish, French, German, Russian)",158.3706564,260,2011,3436,3436]
[1725,"Arts & Humanities","RUSSIAN","Foreign languages (Spanish, French, German, Russian)",159.70512819999999,156,2011,3436,3436]
[1816,"Arts & Humanities","SPANISH","Foreign languages (Spanish, French, German, Russian)",155.08433049999999,1757,2011,3436,3436]
[804,"Arts & Humanities","FOREIGN LANGUAGES","Foreign languages (Spanish, French, German, Russian)",158.422833,474,2012,2898,2898]
[834,"Arts & Humanities","FRENCH","Foreign languages (Spanish, French, German, Russian)",157.8737864,517,2012,2898,2898]
[882,"Arts & Humanities","GERMAN","Foreign languages (Spanish, French, German, Russian)",158.34497820000001,230,2012,2898,{"$f":"VLOOKUP(D1282&G1282,$M$2:$P$436,4)","v":2898}]
[1726,"Arts & Humanities","RUSSIAN","Foreign languages (Spanish, French, German, Russian)",159.53731339999999,134,2012,2898,2898]
[1817,"Arts & Humanities","SPANISH","Foreign languages (Spanish, French, German, Russian)",155.52309690000001,1543,2012,2898,2898]
[805,"Arts & Humanities","FOREIGN LANGUAGES","Foreign languages (Spanish, French, German, Russian)",157.66834170000001,399,2013,2416,2416]
[835,"Arts & Humanities","FRENCH","Foreign languages (Spanish, French, German, Russian)",157.5,396,2013,2416,2416]
[883,"Arts & Humanities","GERMAN","Foreign languages (Spanish, French, German, Russian)",158.58823530000001,188,2013,2416,2416]
[1727,"Arts & Humanities","RUSSIAN","Foreign languages (Spanish, French, German, Russian)",160.70192309999999,104,2013,2416,2416]
[1818,"Arts & Humanities","SPANISH","Foreign languages (Spanish, French, German, Russian)",155.48564949999999,1329,2013,2416,2416]
[806,"Arts & Humanities","FOREIGN LANGUAGES","Foreign languages (Spanish, French, German, Russian)",156.8463476,403,2014,2130,2130]
[836,"Arts & Humanities","FRENCH","Foreign languages (Spanish, French, German, Russian)",157.4375,402,2014,2130,2130]
[884,"Arts & Humanities","GERMAN","Foreign languages (Spanish, French, German, Russian)",157.8653846,159,2014,2130,2130]
[1728,"Arts & Humanities","RUSSIAN","Foreign languages (Spanish, French, German, Russian)",160.69,101,2014,2130,2130]
[1819,"Arts & Humanities","SPANISH","Foreign languages (Spanish, French, German, Russian)",154.3981043,1065,2014,2130,2130]
[807,"Arts & Humanities","FOREIGN LANGUAGES","Foreign languages (Spanish, French, German, Russian)",156.18591549999999,360,2015,1968,1968]
[837,"Arts & Humanities","FRENCH","Foreign languages (Spanish, French, German, Russian)",157.58333329999999,342,2015,1968,1968]
[885,"Arts & Humanities","GERMAN","Foreign languages (Spanish, French, German, Russian)",157.84337350000001,168,2015,1968,1968]
[1729,"Arts & Humanities","RUSSIAN","Foreign languages (Spanish, French, German, Russian)",159.46987949999999,84,2015,1968,1968]
[1820,"Arts & Humanities","SPANISH","Foreign languages (Spanish, French, German, Russian)",154.64378110000001,1014,2015,1968,1968]
[808,"Arts & Humanities","FOREIGN LANGUAGES","Foreign languages (Spanish, French, German, Russian)",156.82215740000001,349,2016,1808,1808]
[838,"Arts & Humanities","FRENCH","Foreign languages (Spanish, French, German, Russian)",156.9911243,343,2016,1808,1808]
[886,"Arts & Humanities","GERMAN","Foreign languages (Spanish, French, German, Russian)",157.58870970000001,125,2016,1808,1808]
[1730,"Arts & Humanities","RUSSIAN","Foreign languages (Spanish, French, German, Russian)",159.42857140000001,85,2016,1808,1808]
[1821,"Arts & Humanities","SPANISH","Foreign languages (Spanish, French, German, Russian)",154.32218510000001,906,2016,1808,1808]
[887,"Social Sciences & Helping Professions","GOVERNMENT/SERVICE","Goverment/Service",155.8625304,823,2002,823,823]
[888,"Social Sciences & Helping Professions","GOVERNMENT/SERVICE","Goverment/Service",155.46614,892,2003,892,892]
[889,"Social Sciences & Helping Professions","GOVERNMENT/SERVICE","Goverment/Service",156.1069574,966,2004,966,966]
[890,"Social Sciences & Helping Professions","GOVERNMENT/SERVICE","Goverment/Service",155.7690504,856,2005,856,856]
[891,"Social Sciences & Helping Professions","GOVERNMENT/SERVICE","Goverment/Service",156.177907,865,2006,865,865]
[892,"Social Sciences & Helping Professions","GOVERNMENT/SERVICE","Goverment/Service",156.31446539999999,799,2007,799,799]
[893,"Social Sciences & Helping Professions","GOVERNMENT/SERVICE","Goverment/Service",156.37061120000001,771,2008,771,771]
[894,"Social Sciences & Helping Professions","GOVERNMENT/SERVICE","Goverment/Service",156.91978610000001,749,2009,749,749]
[895,"Social Sciences & Helping Professions","GOVERNMENT/SERVICE","Goverment/Service",156.88785050000001,751,2010,751,751]
[896,"Social Sciences & Helping Professions","GOVERNMENT/SERVICE","Goverment/Service",157.12924279999999,767,2011,767,767]
[897,"Social Sciences & Helping Professions","GOVERNMENT/SERVICE","Goverment/Service",157.33333329999999,727,2012,727,727]
[898,"Social Sciences & Helping Professions","GOVERNMENT/SERVICE","Goverment/Service",157.14846420000001,587,2013,587,587]
[899,"Social Sciences & Helping Professions","GOVERNMENT/SERVICE","Goverment/Service",157.2055336,513,2014,513,513]
[900,"Social Sciences & Helping Professions","GOVERNMENT/SERVICE","Goverment/Service",157.51008060000001,501,2015,501,501]
[901,"Social Sciences & Helping Professions","GOVERNMENT/SERVICE","Goverment/Service",156.06114400000001,513,2016,513,513]
[87,"Health Professions","ANIMAL SCIENCES/VETERINARY MEDICINE","Health professions (nursing, kinesiology, premed, health care admin.)",150.80000000000001,35,2002,1542,1542]
[584,"Health Professions","DIETETICS/NUTRITIONAL SCIENCE","Health professions (nursing, kinesiology, premed, health care admin.)",150.7592593,55,2002,1542,1542]
[917,"Health Professions","HEALTH PROFESSIONS - OTHER","Health professions (nursing, kinesiology, premed, health care admin.)",149.70114939999999,176,2002,1542,1542]
[932,"Health Professions","HEALTH/KINESIOLOGY","Health professions (nursing, kinesiology, premed, health care admin.)",149.49180329999999,124,2002,1542,1542]
[976,"Health Professions","HOSPITAL/HEALTH CARE ADMINISTRATION","Health professions (nursing, kinesiology, premed, health care admin.)",145.8796992,136,2002,1542,1542]
[1296,"Health Professions","MEDICAL LAB TECHNOLOGY/RADIOLOGY","Health professions (nursing, kinesiology, premed, health care admin.)",147.97959180000001,49,2002,1542,1542]
[1371,"Health Professions","NURSING","Health professions (nursing, kinesiology, premed, health care admin.)",147.09845559999999,534,2002,1542,1542]
[1386,"Health Professions","OCCUPATIONAL THERAPY","Health professions (nursing, kinesiology, premed, health care admin.)",153.58823530000001,17,2002,1542,1542]
[1464,"Social Sciences & Helping Professions","PHYSICAL EDUCATION","Health professions (nursing, kinesiology, premed, health care admin.)",146.45454549999999,55,2002,1542,1542]
[1479,"Natural Sciences","PHYSICAL SCIENCES","Health professions (nursing, kinesiology, premed, health care admin.)",151.38888890000001,18,2002,1542,1542]
[1494,"Health Professions","PHYSICAL THERAPY","Health professions (nursing, kinesiology, premed, health care admin.)",151.97674420000001,45,2002,1542,1542]
[1597,"Health Professions","PREDENTISTRY/DENTISTRY","Health professions (nursing, kinesiology, premed, health care admin.)",146.07142859999999,14,2002,1542,1542]
[1611,"Health Professions","PREMEDICAL/MEDICINE","Health professions (nursing, kinesiology, premed, health care admin.)",152.0096618,209,2002,1542,1542]
[1852,"Health Professions","SPEECH PATHOLOGY/AUDIOLOGY","Health professions (nursing, kinesiology, premed, health care admin.)",148.41333330000001,75,2002,1542,1542]
[88,"Health Professions","ANIMAL SCIENCES/VETERINARY MEDICINE","Health professions (nursing, kinesiology, premed, health care admin.)",150.02500000000001,40,2003,1557,1557]
[585,"Health Professions","DIETETICS/NUTRITIONAL SCIENCE","Health professions (nursing, kinesiology, premed, health care admin.)",151.0983607,61,2003,1557,1557]
[918,"Health Professions","HEALTH PROFESSIONS - OTHER","Health professions (nursing, kinesiology, premed, health care admin.)",149.3348416,225,2003,1557,1557]
[933,"Health Professions","HEALTH/KINESIOLOGY","Health professions (nursing, kinesiology, premed, health care admin.)",149.61073830000001,152,2003,1557,1557]
[977,"Health Professions","HOSPITAL/HEALTH CARE ADMINISTRATION","Health professions (nursing, kinesiology, premed, health care admin.)",146.20588240000001,138,2003,1557,1557]
[1297,"Health Professions","MEDICAL LAB TECHNOLOGY/RADIOLOGY","Health professions (nursing, kinesiology, premed, health care admin.)",147.9111111,45,2003,1557,1557]
[1372,"Health Professions","NURSING","Health professions (nursing, kinesiology, premed, health care admin.)",147.3718245,445,2003,1557,1557]
[1387,"Health Professions","OCCUPATIONAL THERAPY","Health professions (nursing, kinesiology, premed, health care admin.)",148,23,2003,1557,1557]
[1465,"Social Sciences & Helping Professions","PHYSICAL EDUCATION","Health professions (nursing, kinesiology, premed, health care admin.)",146.3529412,52,2003,1557,1557]
[1480,"Natural Sciences","PHYSICAL SCIENCES","Health professions (nursing, kinesiology, premed, health care admin.)",151.91666670000001,12,2003,1557,1557]
[1495,"Health Professions","PHYSICAL THERAPY","Health professions (nursing, kinesiology, premed, health care admin.)",149.93023260000001,43,2003,1557,1557]
[1598,"Health Professions","PREDENTISTRY/DENTISTRY","Health professions (nursing, kinesiology, premed, health care admin.)",146.875,24,2003,1557,1557]
[1612,"Health Professions","PREMEDICAL/MEDICINE","Health professions (nursing, kinesiology, premed, health care admin.)",151.30131,234,2003,1557,{"$f":"VLOOKUP(D1346&G1346,$M$2:$P$436,4)","v":1557}]
[1853,"Health Professions","SPEECH PATHOLOGY/AUDIOLOGY","Health professions (nursing, kinesiology, premed, health care admin.)",150.031746,63,2003,1557,1557]
[89,"Health Professions","ANIMAL SCIENCES/VETERINARY MEDICINE","Health professions (nursing, kinesiology, premed, health care admin.)",151.4482759,30,2004,1312,1312]
[586,"Health Professions","DIETETICS/NUTRITIONAL SCIENCE","Health professions (nursing, kinesiology, premed, health care admin.)",149.47999999999999,50,2004,1312,1312]
[919,"Health Professions","HEALTH PROFESSIONS - OTHER","Health professions (nursing, kinesiology, premed, health care admin.)",148.78770950000001,181,2004,1312,1312]
[934,"Health Professions","HEALTH/KINESIOLOGY","Health professions (nursing, kinesiology, premed, health care admin.)",149.45751630000001,154,2004,1312,1312]
[978,"Health Professions","HOSPITAL/HEALTH CARE ADMINISTRATION","Health professions (nursing, kinesiology, premed, health care admin.)",148.04379560000001,139,2004,1312,1312]
[1298,"Health Professions","MEDICAL LAB TECHNOLOGY/RADIOLOGY","Health professions (nursing, kinesiology, premed, health care admin.)",148.62222220000001,45,2004,1312,1312]
[1373,"Health Professions","NURSING","Health professions (nursing, kinesiology, premed, health care admin.)",147.26330530000001,369,2004,1312,1312]
[1388,"Health Professions","OCCUPATIONAL THERAPY","Health professions (nursing, kinesiology, premed, health care admin.)",144.7333333,30,2004,1312,1312]
[1466,"Social Sciences & Helping Professions","PHYSICAL EDUCATION","Health professions (nursing, kinesiology, premed, health care admin.)",146.14893620000001,47,2004,1312,1312]
[1481,"Natural Sciences","PHYSICAL SCIENCES","Health professions (nursing, kinesiology, premed, health care admin.)",153.55555559999999,20,2004,1312,1312]
[1496,"Health Professions","PHYSICAL THERAPY","Health professions (nursing, kinesiology, premed, health care admin.)",148.09523809999999,21,2004,1312,1312]
[1599,"Health Professions","PREDENTISTRY/DENTISTRY","Health professions (nursing, kinesiology, premed, health care admin.)",147.6153846,13,2004,1312,1312]
[1613,"Health Professions","PREMEDICAL/MEDICINE","Health professions (nursing, kinesiology, premed, health care admin.)",151.9638554,170,2004,1312,1312]
[1854,"Health Professions","SPEECH PATHOLOGY/AUDIOLOGY","Health professions (nursing, kinesiology, premed, health care admin.)",149.59523809999999,43,2004,1312,1312]
[90,"Health Professions","ANIMAL SCIENCES/VETERINARY MEDICINE","Health professions (nursing, kinesiology, premed, health care admin.)",151.5,23,2005,1243,1243]
[587,"Health Professions","DIETETICS/NUTRITIONAL SCIENCE","Health professions (nursing, kinesiology, premed, health care admin.)",151.0909091,44,2005,1243,1243]
[920,"Health Professions","HEALTH PROFESSIONS - OTHER","Health professions (nursing, kinesiology, premed, health care admin.)",148.3121951,213,2005,1243,1243]
[935,"Health Professions","HEALTH/KINESIOLOGY","Health professions (nursing, kinesiology, premed, health care admin.)",150.17322830000001,127,2005,1243,1243]
[979,"Health Professions","HOSPITAL/HEALTH CARE ADMINISTRATION","Health professions (nursing, kinesiology, premed, health care admin.)",147.00917430000001,110,2005,1243,1243]
[1299,"Health Professions","MEDICAL LAB TECHNOLOGY/RADIOLOGY","Health professions (nursing, kinesiology, premed, health care admin.)",148.0243902,42,2005,1243,1243]
[1374,"Health Professions","NURSING","Health professions (nursing, kinesiology, premed, health care admin.)",147.56,344,2005,1243,1243]
[1389,"Health Professions","OCCUPATIONAL THERAPY","Health professions (nursing, kinesiology, premed, health care admin.)",145.2777778,19,2005,1243,1243]
[1467,"Social Sciences & Helping Professions","PHYSICAL EDUCATION","Health professions (nursing, kinesiology, premed, health care admin.)",146.9375,34,2005,1243,1243]
[1482,"Natural Sciences","PHYSICAL SCIENCES","Health professions (nursing, kinesiology, premed, health care admin.)",149.7894737,19,2005,1243,1243]
[1497,"Health Professions","PHYSICAL THERAPY","Health professions (nursing, kinesiology, premed, health care admin.)",150.15,20,2005,1243,1243]
[1600,"Health Professions","PREDENTISTRY/DENTISTRY","Health professions (nursing, kinesiology, premed, health care admin.)",145.4375,16,2005,1243,1243]
[1614,"Health Professions","PREMEDICAL/MEDICINE","Health professions (nursing, kinesiology, premed, health care admin.)",151.49489800000001,196,2005,1243,1243]
[1855,"Health Professions","SPEECH PATHOLOGY/AUDIOLOGY","Health professions (nursing, kinesiology, premed, health care admin.)",150.08333329999999,36,2005,1243,1243]
[91,"Health Professions","ANIMAL SCIENCES/VETERINARY MEDICINE","Health professions (nursing, kinesiology, premed, health care admin.)",149.625,17,2006,1041,1041]
[588,"Health Professions","DIETETICS/NUTRITIONAL SCIENCE","Health professions (nursing, kinesiology, premed, health care admin.)",151.53333330000001,30,2006,1041,1041]
[921,"Health Professions","HEALTH PROFESSIONS - OTHER","Health professions (nursing, kinesiology, premed, health care admin.)",149.76315790000001,193,2006,1041,1041]
[936,"Health Professions","HEALTH/KINESIOLOGY","Health professions (nursing, kinesiology, premed, health care admin.)",150.3461538,107,2006,1041,1041]
[980,"Health Professions","HOSPITAL/HEALTH CARE ADMINISTRATION","Health professions (nursing, kinesiology, premed, health care admin.)",148.19047620000001,89,2006,1041,1041]
[1300,"Health Professions","MEDICAL LAB TECHNOLOGY/RADIOLOGY","Health professions (nursing, kinesiology, premed, health care admin.)",149.25,37,2006,1041,1041]
[1375,"Health Professions","NURSING","Health professions (nursing, kinesiology, premed, health care admin.)",147.3453815,262,2006,1041,1041]
[1390,"Health Professions","OCCUPATIONAL THERAPY","Health professions (nursing, kinesiology, premed, health care admin.)",150.2307692,13,2006,1041,1041]
[1468,"Social Sciences & Helping Professions","PHYSICAL EDUCATION","Health professions (nursing, kinesiology, premed, health care admin.)",146.55555559999999,36,2006,1041,1041]
[1483,"Natural Sciences","PHYSICAL SCIENCES","Health professions (nursing, kinesiology, premed, health care admin.)",153.63636360000001,12,2006,1041,1041]
[1498,"Health Professions","PHYSICAL THERAPY","Health professions (nursing, kinesiology, premed, health care admin.)",149.16,25,2006,1041,1041]
[1601,"Health Professions","PREDENTISTRY/DENTISTRY","Health professions (nursing, kinesiology, premed, health care admin.)",146.88888890000001,9,2006,1041,1041]
[1615,"Health Professions","PREMEDICAL/MEDICINE","Health professions (nursing, kinesiology, premed, health care admin.)",152.68452379999999,170,2006,1041,1041]
[1856,"Health Professions","SPEECH PATHOLOGY/AUDIOLOGY","Health professions (nursing, kinesiology, premed, health care admin.)",150.51219510000001,41,2006,1041,1041]
[92,"Health Professions","ANIMAL SCIENCES/VETERINARY MEDICINE","Health professions (nursing, kinesiology, premed, health care admin.)",152.2307692,13,2007,914,914]
[589,"Health Professions","DIETETICS/NUTRITIONAL SCIENCE","Health professions (nursing, kinesiology, premed, health care admin.)",153,35,2007,914,914]
[922,"Health Professions","HEALTH PROFESSIONS - OTHER","Health professions (nursing, kinesiology, premed, health care admin.)",149.04,178,2007,914,914]
[937,"Health Professions","HEALTH/KINESIOLOGY","Health professions (nursing, kinesiology, premed, health care admin.)",151.44444440000001,108,2007,914,914]
[981,"Health Professions","HOSPITAL/HEALTH CARE ADMINISTRATION","Health professions (nursing, kinesiology, premed, health care admin.)",147.0140845,74,2007,914,914]
[1301,"Health Professions","MEDICAL LAB TECHNOLOGY/RADIOLOGY","Health professions (nursing, kinesiology, premed, health care admin.)",145.17857140000001,28,2007,914,914]
[1376,"Health Professions","NURSING","Health professions (nursing, kinesiology, premed, health care admin.)",147.0844444,229,2007,914,914]
[1391,"Health Professions","OCCUPATIONAL THERAPY","Health professions (nursing, kinesiology, premed, health care admin.)",148.16666670000001,6,2007,914,914]
[1469,"Social Sciences & Helping Professions","PHYSICAL EDUCATION","Health professions (nursing, kinesiology, premed, health care admin.)",146.9,20,2007,914,914]
[1484,"Natural Sciences","PHYSICAL SCIENCES","Health professions (nursing, kinesiology, premed, health care admin.)",150,16,2007,914,914]
[1499,"Health Professions","PHYSICAL THERAPY","Health professions (nursing, kinesiology, premed, health care admin.)",146.80000000000001,10,2007,914,914]
[1602,"Health Professions","PREDENTISTRY/DENTISTRY","Health professions (nursing, kinesiology, premed, health care admin.)",150.66666670000001,7,2007,914,914]
[1616,"Health Professions","PREMEDICAL/MEDICINE","Health professions (nursing, kinesiology, premed, health care admin.)",152.85897439999999,156,2007,914,914]
[1857,"Health Professions","SPEECH PATHOLOGY/AUDIOLOGY","Health professions (nursing, kinesiology, premed, health care admin.)",149.9393939,34,2007,914,914]
[93,"Health Professions","ANIMAL SCIENCES/VETERINARY MEDICINE","Health professions (nursing, kinesiology, premed, health care admin.)",154.55555559999999,18,2008,845,845]
[590,"Health Professions","DIETETICS/NUTRITIONAL SCIENCE","Health professions (nursing, kinesiology, premed, health care admin.)",154.32352940000001,35,2008,845,845]
[923,"Health Professions","HEALTH PROFESSIONS - OTHER","Health professions (nursing, kinesiology, premed, health care admin.)",149.29239770000001,172,2008,845,845]
[938,"Health Professions","HEALTH/KINESIOLOGY","Health professions (nursing, kinesiology, premed, health care admin.)",150.56862749999999,102,2008,845,845]
[982,"Health Professions","HOSPITAL/HEALTH CARE ADMINISTRATION","Health professions (nursing, kinesiology, premed, health care admin.)",145.37333330000001,79,2008,845,845]
[1302,"Health Professions","MEDICAL LAB TECHNOLOGY/RADIOLOGY","Health professions (nursing, kinesiology, premed, health care admin.)",148.29411759999999,18,2008,845,845]
[1377,"Health Professions","NURSING","Health professions (nursing, kinesiology, premed, health care admin.)",147.48275860000001,212,2008,845,{"$f":"VLOOKUP(D1410&G1410,$M$2:$P$436,4)","v":845}]
[1392,"Health Professions","OCCUPATIONAL THERAPY","Health professions (nursing, kinesiology, premed, health care admin.)",146.7142857,7,2008,845,845]
[1470,"Social Sciences & Helping Professions","PHYSICAL EDUCATION","Health professions (nursing, kinesiology, premed, health care admin.)",143.94117650000001,18,2008,845,845]
[1485,"Natural Sciences","PHYSICAL SCIENCES","Health professions (nursing, kinesiology, premed, health care admin.)",153.69999999999999,10,2008,845,845]
[1500,"Health Professions","PHYSICAL THERAPY","Health professions (nursing, kinesiology, premed, health care admin.)",150.07692309999999,13,2008,845,845]
[1617,"Health Professions","PREMEDICAL/MEDICINE","Health professions (nursing, kinesiology, premed, health care admin.)",153.14728679999999,130,2008,845,845]
[1858,"Health Professions","SPEECH PATHOLOGY/AUDIOLOGY","Health professions (nursing, kinesiology, premed, health care admin.)",151.7741935,31,2008,845,845]
[94,"Health Professions","ANIMAL SCIENCES/VETERINARY MEDICINE","Health professions (nursing, kinesiology, premed, health care admin.)",146.9090909,11,2009,879,879]
[591,"Health Professions","DIETETICS/NUTRITIONAL SCIENCE","Health professions (nursing, kinesiology, premed, health care admin.)",152.40540540000001,39,2009,879,879]
[924,"Health Professions","HEALTH PROFESSIONS - OTHER","Health professions (nursing, kinesiology, premed, health care admin.)",149.2752294,222,2009,879,879]
[939,"Health Professions","HEALTH/KINESIOLOGY","Health professions (nursing, kinesiology, premed, health care admin.)",151.18918919999999,112,2009,879,879]
[983,"Health Professions","HOSPITAL/HEALTH CARE ADMINISTRATION","Health professions (nursing, kinesiology, premed, health care admin.)",147.12676060000001,74,2009,879,879]
[1303,"Health Professions","MEDICAL LAB TECHNOLOGY/RADIOLOGY","Health professions (nursing, kinesiology, premed, health care admin.)",145.5,16,2009,879,879]
[1378,"Health Professions","NURSING","Health professions (nursing, kinesiology, premed, health care admin.)",146.4,198,2009,879,879]
[1393,"Health Professions","OCCUPATIONAL THERAPY","Health professions (nursing, kinesiology, premed, health care admin.)",145.57142859999999,7,2009,879,879]
[1471,"Social Sciences & Helping Professions","PHYSICAL EDUCATION","Health professions (nursing, kinesiology, premed, health care admin.)",144.952381,21,2009,879,879]
[1486,"Natural Sciences","PHYSICAL SCIENCES","Health professions (nursing, kinesiology, premed, health care admin.)",152.75,12,2009,879,879]
[1501,"Health Professions","PHYSICAL THERAPY","Health professions (nursing, kinesiology, premed, health care admin.)",151.07692309999999,14,2009,879,879]
[1603,"Health Professions","PREDENTISTRY/DENTISTRY","Health professions (nursing, kinesiology, premed, health care admin.)",146.19999999999999,6,2009,879,879]
[1618,"Health Professions","PREMEDICAL/MEDICINE","Health professions (nursing, kinesiology, premed, health care admin.)",153.26612900000001,125,2009,879,879]
[1859,"Health Professions","SPEECH PATHOLOGY/AUDIOLOGY","Health professions (nursing, kinesiology, premed, health care admin.)",151.31818179999999,22,2009,879,879]
[95,"Health Professions","ANIMAL SCIENCES/VETERINARY MEDICINE","Health professions (nursing, kinesiology, premed, health care admin.)",155.69999999999999,10,2010,890,890]
[592,"Health Professions","DIETETICS/NUTRITIONAL SCIENCE","Health professions (nursing, kinesiology, premed, health care admin.)",150.6571429,35,2010,890,890]
[925,"Health Professions","HEALTH PROFESSIONS - OTHER","Health professions (nursing, kinesiology, premed, health care admin.)",149.63529410000001,175,2010,890,890]
[940,"Health Professions","HEALTH/KINESIOLOGY","Health professions (nursing, kinesiology, premed, health care admin.)",150.9492754,139,2010,890,890]
[984,"Health Professions","HOSPITAL/HEALTH CARE ADMINISTRATION","Health professions (nursing, kinesiology, premed, health care admin.)",148.80434779999999,95,2010,890,890]
[1304,"Health Professions","MEDICAL LAB TECHNOLOGY/RADIOLOGY","Health professions (nursing, kinesiology, premed, health care admin.)",147.33333329999999,25,2010,890,890]
[1379,"Health Professions","NURSING","Health professions (nursing, kinesiology, premed, health care admin.)",147.3406593,188,2010,890,890]
[1394,"Health Professions","OCCUPATIONAL THERAPY","Health professions (nursing, kinesiology, premed, health care admin.)",153.375,9,2010,890,890]
[1472,"Social Sciences & Helping Professions","PHYSICAL EDUCATION","Health professions (nursing, kinesiology, premed, health care admin.)",150.047619,21,2010,890,890]
[1487,"Natural Sciences","PHYSICAL SCIENCES","Health professions (nursing, kinesiology, premed, health care admin.)",150.33333329999999,12,2010,890,890]
[1502,"Health Professions","PHYSICAL THERAPY","Health professions (nursing, kinesiology, premed, health care admin.)",149.69999999999999,10,2010,890,890]
[1604,"Health Professions","PREDENTISTRY/DENTISTRY","Health professions (nursing, kinesiology, premed, health care admin.)",150.88888890000001,9,2010,890,890]
[1619,"Health Professions","PREMEDICAL/MEDICINE","Health professions (nursing, kinesiology, premed, health care admin.)",152.7462687,134,2010,890,890]
[1860,"Health Professions","SPEECH PATHOLOGY/AUDIOLOGY","Health professions (nursing, kinesiology, premed, health care admin.)",151,28,2010,890,890]
[96,"Health Professions","ANIMAL SCIENCES/VETERINARY MEDICINE","Health professions (nursing, kinesiology, premed, health care admin.)",155.18181820000001,12,2011,857,857]
[593,"Health Professions","DIETETICS/NUTRITIONAL SCIENCE","Health professions (nursing, kinesiology, premed, health care admin.)",150.43902439999999,42,2011,857,857]
[926,"Health Professions","HEALTH PROFESSIONS - OTHER","Health professions (nursing, kinesiology, premed, health care admin.)",149.84433960000001,217,2011,857,857]
[941,"Health Professions","HEALTH/KINESIOLOGY","Health professions (nursing, kinesiology, premed, health care admin.)",151.8625954,131,2011,857,857]
[985,"Health Professions","HOSPITAL/HEALTH CARE ADMINISTRATION","Health professions (nursing, kinesiology, premed, health care admin.)",148.2234043,97,2011,857,857]
[1305,"Health Professions","MEDICAL LAB TECHNOLOGY/RADIOLOGY","Health professions (nursing, kinesiology, premed, health care admin.)",150.8666667,15,2011,857,857]
[1380,"Health Professions","NURSING","Health professions (nursing, kinesiology, premed, health care admin.)",146.78145699999999,155,2011,857,857]
[1395,"Health Professions","OCCUPATIONAL THERAPY","Health professions (nursing, kinesiology, premed, health care admin.)",149.6,5,2011,857,857]
[1473,"Social Sciences & Helping Professions","PHYSICAL EDUCATION","Health professions (nursing, kinesiology, premed, health care admin.)",146.77272730000001,22,2011,857,857]
[1488,"Natural Sciences","PHYSICAL SCIENCES","Health professions (nursing, kinesiology, premed, health care admin.)",153.46666669999999,15,2011,857,857]
[1503,"Health Professions","PHYSICAL THERAPY","Health professions (nursing, kinesiology, premed, health care admin.)",152.72727269999999,11,2011,857,857]
[1605,"Health Professions","PREDENTISTRY/DENTISTRY","Health professions (nursing, kinesiology, premed, health care admin.)",142.16666670000001,6,2011,857,857]
[1620,"Health Professions","PREMEDICAL/MEDICINE","Health professions (nursing, kinesiology, premed, health care admin.)",153.66990290000001,106,2011,857,857]
[1861,"Health Professions","SPEECH PATHOLOGY/AUDIOLOGY","Health professions (nursing, kinesiology, premed, health care admin.)",152.26086960000001,23,2011,857,857]
[97,"Health Professions","ANIMAL SCIENCES/VETERINARY MEDICINE","Health professions (nursing, kinesiology, premed, health care admin.)",152.36363639999999,11,2012,831,831]
[594,"Health Professions","DIETETICS/NUTRITIONAL SCIENCE","Health professions (nursing, kinesiology, premed, health care admin.)",153.55000000000001,40,2012,831,831]
[927,"Health Professions","HEALTH PROFESSIONS - OTHER","Health professions (nursing, kinesiology, premed, health care admin.)",148.40291260000001,209,2012,831,831]
[942,"Health Professions","HEALTH/KINESIOLOGY","Health professions (nursing, kinesiology, premed, health care admin.)",151.68852459999999,122,2012,831,831]
[986,"Health Professions","HOSPITAL/HEALTH CARE ADMINISTRATION","Health professions (nursing, kinesiology, premed, health care admin.)",146.69148939999999,94,2012,831,831]
[1306,"Health Professions","MEDICAL LAB TECHNOLOGY/RADIOLOGY","Health professions (nursing, kinesiology, premed, health care admin.)",149.3529412,17,2012,831,831]
[1381,"Health Professions","NURSING","Health professions (nursing, kinesiology, premed, health care admin.)",146.664557,160,2012,831,831]
[1474,"Social Sciences & Helping Professions","PHYSICAL EDUCATION","Health professions (nursing, kinesiology, premed, health care admin.)",148.8823529,18,2012,831,831]
[1489,"Natural Sciences","PHYSICAL SCIENCES","Health professions (nursing, kinesiology, premed, health care admin.)",153.66666670000001,15,2012,831,831]
[1504,"Health Professions","PHYSICAL THERAPY","Health professions (nursing, kinesiology, premed, health care admin.)",148,8,2012,831,831]
[1606,"Health Professions","PREDENTISTRY/DENTISTRY","Health professions (nursing, kinesiology, premed, health care admin.)",144,10,2012,831,831]
[1621,"Health Professions","PREMEDICAL/MEDICINE","Health professions (nursing, kinesiology, premed, health care admin.)",152.59047620000001,106,2012,831,831]
[1862,"Health Professions","SPEECH PATHOLOGY/AUDIOLOGY","Health professions (nursing, kinesiology, premed, health care admin.)",151.05000000000001,21,2012,831,831]
[98,"Health Professions","ANIMAL SCIENCES/VETERINARY MEDICINE","Health professions (nursing, kinesiology, premed, health care admin.)",150.9,10,2013,729,729]
[595,"Health Professions","DIETETICS/NUTRITIONAL SCIENCE","Health professions (nursing, kinesiology, premed, health care admin.)",152.66666670000001,33,2013,729,729]
[928,"Health Professions","HEALTH PROFESSIONS - OTHER","Health professions (nursing, kinesiology, premed, health care admin.)",148.984375,199,2013,729,{"$f":"VLOOKUP(D1474&G1474,$M$2:$P$436,4)","v":729}]
[943,"Health Professions","HEALTH/KINESIOLOGY","Health professions (nursing, kinesiology, premed, health care admin.)",152.85046729999999,109,2013,729,729]
[987,"Health Professions","HOSPITAL/HEALTH CARE ADMINISTRATION","Health professions (nursing, kinesiology, premed, health care admin.)",145.75757580000001,67,2013,729,729]
[1307,"Health Professions","MEDICAL LAB TECHNOLOGY/RADIOLOGY","Health professions (nursing, kinesiology, premed, health care admin.)",149.63636360000001,11,2013,729,729]
[1382,"Health Professions","NURSING","Health professions (nursing, kinesiology, premed, health care admin.)",146.1623932,121,2013,729,729]
[1475,"Social Sciences & Helping Professions","PHYSICAL EDUCATION","Health professions (nursing, kinesiology, premed, health care admin.)",150.90476190000001,21,2013,729,729]
[1490,"Natural Sciences","PHYSICAL SCIENCES","Health professions (nursing, kinesiology, premed, health care admin.)",154.7777778,18,2013,729,729]
[1505,"Health Professions","PHYSICAL THERAPY","Health professions (nursing, kinesiology, premed, health care admin.)",149.2857143,7,2013,729,729]
[1607,"Health Professions","PREDENTISTRY/DENTISTRY","Health professions (nursing, kinesiology, premed, health care admin.)",150.7777778,9,2013,729,729]
[1622,"Health Professions","PREMEDICAL/MEDICINE","Health professions (nursing, kinesiology, premed, health care admin.)",152.99009899999999,101,2013,729,729]
[1863,"Health Professions","SPEECH PATHOLOGY/AUDIOLOGY","Health professions (nursing, kinesiology, premed, health care admin.)",150.47826090000001,23,2013,729,729]
[99,"Health Professions","ANIMAL SCIENCES/VETERINARY MEDICINE","Health professions (nursing, kinesiology, premed, health care admin.)",153.06666670000001,15,2014,683,683]
[596,"Health Professions","DIETETICS/NUTRITIONAL SCIENCE","Health professions (nursing, kinesiology, premed, health care admin.)",150.80000000000001,26,2014,683,683]
[929,"Health Professions","HEALTH PROFESSIONS - OTHER","Health professions (nursing, kinesiology, premed, health care admin.)",148.34394900000001,165,2014,683,683]
[944,"Health Professions","HEALTH/KINESIOLOGY","Health professions (nursing, kinesiology, premed, health care admin.)",151.06194690000001,114,2014,683,683]
[988,"Health Professions","HOSPITAL/HEALTH CARE ADMINISTRATION","Health professions (nursing, kinesiology, premed, health care admin.)",145.4029851,68,2014,683,683]
[1308,"Health Professions","MEDICAL LAB TECHNOLOGY/RADIOLOGY","Health professions (nursing, kinesiology, premed, health care admin.)",146.46666669999999,15,2014,683,683]
[1383,"Health Professions","NURSING","Health professions (nursing, kinesiology, premed, health care admin.)",144.8392857,126,2014,683,683]
[1476,"Social Sciences & Helping Professions","PHYSICAL EDUCATION","Health professions (nursing, kinesiology, premed, health care admin.)",147.2666667,15,2014,683,683]
[1491,"Natural Sciences","PHYSICAL SCIENCES","Health professions (nursing, kinesiology, premed, health care admin.)",151.18181820000001,11,2014,683,683]
[1506,"Health Professions","PHYSICAL THERAPY","Health professions (nursing, kinesiology, premed, health care admin.)",149.14285709999999,7,2014,683,683]
[1608,"Health Professions","PREDENTISTRY/DENTISTRY","Health professions (nursing, kinesiology, premed, health care admin.)",149.4,10,2014,683,683]
[1623,"Health Professions","PREMEDICAL/MEDICINE","Health professions (nursing, kinesiology, premed, health care admin.)",151.4945055,93,2014,683,683]
[1864,"Health Professions","SPEECH PATHOLOGY/AUDIOLOGY","Health professions (nursing, kinesiology, premed, health care admin.)",147.2352941,18,2014,683,683]
[100,"Health Professions","ANIMAL SCIENCES/VETERINARY MEDICINE","Health professions (nursing, kinesiology, premed, health care admin.)",154.80000000000001,10,2015,683,683]
[597,"Health Professions","DIETETICS/NUTRITIONAL SCIENCE","Health professions (nursing, kinesiology, premed, health care admin.)",151.88888890000001,18,2015,683,683]
[930,"Health Professions","HEALTH PROFESSIONS - OTHER","Health professions (nursing, kinesiology, premed, health care admin.)",149.73480660000001,184,2015,683,683]
[945,"Health Professions","HEALTH/KINESIOLOGY","Health professions (nursing, kinesiology, premed, health care admin.)",151.2372881,119,2015,683,683]
[989,"Health Professions","HOSPITAL/HEALTH CARE ADMINISTRATION","Health professions (nursing, kinesiology, premed, health care admin.)",144.5909091,71,2015,683,683]
[1309,"Health Professions","MEDICAL LAB TECHNOLOGY/RADIOLOGY","Health professions (nursing, kinesiology, premed, health care admin.)",150.66666670000001,10,2015,683,683]
[1384,"Health Professions","NURSING","Health professions (nursing, kinesiology, premed, health care admin.)",146.8292683,130,2015,683,683]
[1477,"Social Sciences & Helping Professions","PHYSICAL EDUCATION","Health professions (nursing, kinesiology, premed, health care admin.)",140.2222222,11,2015,683,683]
[1492,"Natural Sciences","PHYSICAL SCIENCES","Health professions (nursing, kinesiology, premed, health care admin.)",150.88888890000001,9,2015,683,683]
[1507,"Health Professions","PHYSICAL THERAPY","Health professions (nursing, kinesiology, premed, health care admin.)",143.875,8,2015,683,683]
[1609,"Health Professions","PREDENTISTRY/DENTISTRY","Health professions (nursing, kinesiology, premed, health care admin.)",145.7777778,9,2015,683,683]
[1624,"Health Professions","PREMEDICAL/MEDICINE","Health professions (nursing, kinesiology, premed, health care admin.)",151.78313249999999,86,2015,683,683]
[1865,"Health Professions","SPEECH PATHOLOGY/AUDIOLOGY","Health professions (nursing, kinesiology, premed, health care admin.)",147.61111109999999,18,2015,683,683]
[101,"Health Professions","ANIMAL SCIENCES/VETERINARY MEDICINE","Health professions (nursing, kinesiology, premed, health care admin.)",152.2666667,15,2016,755,755]
[598,"Health Professions","DIETETICS/NUTRITIONAL SCIENCE","Health professions (nursing, kinesiology, premed, health care admin.)",149.75862069999999,29,2016,755,755]
[931,"Health Professions","HEALTH PROFESSIONS - OTHER","Health professions (nursing, kinesiology, premed, health care admin.)",148.34653470000001,211,2016,755,755]
[946,"Health Professions","HEALTH/KINESIOLOGY","Health professions (nursing, kinesiology, premed, health care admin.)",150.6376812,145,2016,755,755]
[990,"Health Professions","HOSPITAL/HEALTH CARE ADMINISTRATION","Health professions (nursing, kinesiology, premed, health care admin.)",148.5,85,2016,755,755]
[1310,"Health Professions","MEDICAL LAB TECHNOLOGY/RADIOLOGY","Health professions (nursing, kinesiology, premed, health care admin.)",144.18181820000001,11,2016,755,755]
[1385,"Health Professions","NURSING","Health professions (nursing, kinesiology, premed, health care admin.)",145.5277778,113,2016,755,755]
[1478,"Social Sciences & Helping Professions","PHYSICAL EDUCATION","Health professions (nursing, kinesiology, premed, health care admin.)",143.9090909,11,2016,755,755]
[1493,"Natural Sciences","PHYSICAL SCIENCES","Health professions (nursing, kinesiology, premed, health care admin.)",152.25,8,2016,755,755]
[1508,"Health Professions","PHYSICAL THERAPY","Health professions (nursing, kinesiology, premed, health care admin.)",148,10,2016,755,755]
[1610,"Health Professions","PREDENTISTRY/DENTISTRY","Health professions (nursing, kinesiology, premed, health care admin.)",139.19999999999999,5,2016,755,755]
[1625,"Health Professions","PREMEDICAL/MEDICINE","Health professions (nursing, kinesiology, premed, health care admin.)",152.59340660000001,94,2016,755,755]
[1866,"Health Professions","SPEECH PATHOLOGY/AUDIOLOGY","Health professions (nursing, kinesiology, premed, health care admin.)",150.05555559999999,18,2016,755,755]
[947,"Social Sciences & Helping Professions","HISTORY","History",154.66192910000001,6296,2002,6296,6296]
[948,"Social Sciences & Helping Professions","HISTORY","History",154.87521369999999,6455,2003,6455,6455]
[949,"Social Sciences & Helping Professions","HISTORY","History",155.56293880000001,6139,2004,6139,6139]
[950,"Social Sciences & Helping Professions","HISTORY","History",155.5257095,6013,2005,6013,6013]
[951,"Social Sciences & Helping Professions","HISTORY","History",156.08428090000001,5998,2006,5998,5998]
[952,"Social Sciences & Helping Professions","HISTORY","History",156.22629670000001,6068,2007,6068,6068]
[953,"Social Sciences & Helping Professions","HISTORY","History",156.54721799999999,5894,2008,5894,5894]
[954,"Social Sciences & Helping Professions","HISTORY","History",156.63929519999999,5689,2009,5689,5689]
[955,"Social Sciences & Helping Professions","HISTORY","History",156.72304890000001,6069,2010,6069,6069]
[956,"Social Sciences & Helping Professions","HISTORY","History",156.95632810000001,5848,2011,5848,5848]
[957,"Social Sciences & Helping Professions","HISTORY","History",156.8423191,5424,2012,5424,5424]
[958,"Social Sciences & Helping Professions","HISTORY","History",156.4444919,4698,2013,4698,4698]
[959,"Social Sciences & Helping Professions","HISTORY","History",156.27999,4061,2014,4061,4061]
[960,"Social Sciences & Helping Professions","HISTORY","History",156.35365849999999,3729,2015,3729,3729]
[961,"Social Sciences & Helping Professions","HISTORY","History",156.0729863,3472,2016,3472,{"$f":"VLOOKUP(D1538&G1538,$M$2:$P$436,4)","v":3472}]
[1096,"Arts & Humanities","INTERDISCIPLINARY STUDIES","Interdisciplinary Studies",153.61456100000001,470,2002,470,470]
[1097,"Arts & Humanities","INTERDISCIPLINARY STUDIES","Interdisciplinary Studies",154.4157706,563,2003,563,563]
[1098,"Arts & Humanities","INTERDISCIPLINARY STUDIES","Interdisciplinary Studies",155.19183670000001,742,2004,742,742]
[1099,"Arts & Humanities","INTERDISCIPLINARY STUDIES","Interdisciplinary Studies",155.7712344,889,2005,889,889]
[1100,"Arts & Humanities","INTERDISCIPLINARY STUDIES","Interdisciplinary Studies",155.96933960000001,852,2006,852,852]
[1101,"Arts & Humanities","INTERDISCIPLINARY STUDIES","Interdisciplinary Studies",155.9173127,777,2007,777,777]
[1102,"Arts & Humanities","INTERDISCIPLINARY STUDIES","Interdisciplinary Studies",156.2653846,788,2008,788,788]
[1103,"Arts & Humanities","INTERDISCIPLINARY STUDIES","Interdisciplinary Studies",156.60424029999999,855,2009,855,855]
[1104,"Arts & Humanities","INTERDISCIPLINARY STUDIES","Interdisciplinary Studies",155.81746920000001,899,2010,899,899]
[1105,"Arts & Humanities","INTERDISCIPLINARY STUDIES","Interdisciplinary Studies",156.38613860000001,916,2011,916,916]
[1106,"Arts & Humanities","INTERDISCIPLINARY STUDIES","Interdisciplinary Studies",155.26683610000001,793,2012,793,793]
[1107,"Arts & Humanities","INTERDISCIPLINARY STUDIES","Interdisciplinary Studies",155.54142010000001,680,2013,680,680]
[1108,"Arts & Humanities","INTERDISCIPLINARY STUDIES","Interdisciplinary Studies",154.20385229999999,638,2014,638,638]
[1109,"Arts & Humanities","INTERDISCIPLINARY STUDIES","Interdisciplinary Studies",154.67548500000001,587,2015,587,587]
[1110,"Arts & Humanities","INTERDISCIPLINARY STUDIES","Interdisciplinary Studies",154.52371919999999,538,2016,538,538]
[1139,"Social Sciences & Helping Professions","INTERNATIONAL RELATIONS","International relations/International studies",155.2159686,1533,2002,1533,1533]
[1140,"Social Sciences & Helping Professions","INTERNATIONAL RELATIONS","International relations/International studies",155.62979189999999,1834,2003,1834,1834]
[1141,"Social Sciences & Helping Professions","INTERNATIONAL RELATIONS","International relations/International studies",155.88042920000001,1963,2004,1963,1963]
[1142,"Social Sciences & Helping Professions","INTERNATIONAL RELATIONS","International relations/International studies",156.50363899999999,2068,2005,2068,2068]
[1143,"Social Sciences & Helping Professions","INTERNATIONAL RELATIONS","International relations/International studies",157.01272639999999,2050,2006,2050,2050]
[1144,"Social Sciences & Helping Professions","INTERNATIONAL RELATIONS","International relations/International studies",157.1537002,2114,2007,2114,2114]
[1145,"Social Sciences & Helping Professions","INTERNATIONAL RELATIONS","International relations/International studies",157.18346769999999,1988,2008,1988,1988]
[1146,"Social Sciences & Helping Professions","INTERNATIONAL RELATIONS","International relations/International studies",157.2369338,2011,2009,2011,2011]
[1147,"Social Sciences & Helping Professions","INTERNATIONAL RELATIONS","International relations/International studies",157.62955120000001,2368,2010,2377,2377]
[1154,"Social Sciences & Helping Professions","INTERNATIONAL STUDIES","International relations/International studies",159.33333329999999,9,2010,2377,2377]
[1148,"Social Sciences & Helping Professions","INTERNATIONAL RELATIONS","International relations/International studies",158.15872300000001,2228,2011,2598,2598]
[1155,"Social Sciences & Helping Professions","INTERNATIONAL STUDIES","International relations/International studies",156.2486486,370,2011,2598,2598]
[1149,"Social Sciences & Helping Professions","INTERNATIONAL RELATIONS","International relations/International studies",157.78061829999999,1683,2012,2529,2529]
[1156,"Social Sciences & Helping Professions","INTERNATIONAL STUDIES","International relations/International studies",157.92882560000001,846,2012,2529,2529]
[1150,"Social Sciences & Helping Professions","INTERNATIONAL RELATIONS","International relations/International studies",157.6289262,1371,2013,2262,2262]
[1157,"Social Sciences & Helping Professions","INTERNATIONAL STUDIES","International relations/International studies",157.54994389999999,891,2013,2262,2262]
[1151,"Social Sciences & Helping Professions","INTERNATIONAL RELATIONS","International relations/International studies",157.56412560000001,1124,2014,1932,1932]
[1158,"Social Sciences & Helping Professions","INTERNATIONAL STUDIES","International relations/International studies",157.15756819999999,808,2014,1932,1932]
[1152,"Social Sciences & Helping Professions","INTERNATIONAL RELATIONS","International relations/International studies",157.40183490000001,1098,2015,1904,1904]
[1159,"Social Sciences & Helping Professions","INTERNATIONAL STUDIES","International relations/International studies",157.15269090000001,806,2015,1904,1904]
[1153,"Social Sciences & Helping Professions","INTERNATIONAL RELATIONS","International relations/International studies",157.0396825,1026,2016,1738,1738]
[1160,"Social Sciences & Helping Professions","INTERNATIONAL STUDIES","International relations/International studies",157.18723399999999,712,2016,1738,1738]
[207,"Arts & Humanities","ARTS & HUMANITIES - OTHER","Liberal arts/Other arts and humanities",154.54612789999999,1492,2002,2403,2403]
[1176,"Arts & Humanities","LIBERAL ARTS","Liberal arts/Other arts and humanities",149.6529477,911,2002,2403,2403]
[208,"Arts & Humanities","ARTS & HUMANITIES - OTHER","Liberal arts/Other arts and humanities",154.60270270000001,2235,2003,3445,3445]
[1177,"Arts & Humanities","LIBERAL ARTS","Liberal arts/Other arts and humanities",150.24080269999999,1210,2003,3445,3445]
[209,"Arts & Humanities","ARTS & HUMANITIES - OTHER","Liberal arts/Other arts and humanities",154.72352079999999,2749,2004,4329,4329]
[1178,"Arts & Humanities","LIBERAL ARTS","Liberal arts/Other arts and humanities",150.58748399999999,1580,2004,4329,4329]
[210,"Arts & Humanities","ARTS & HUMANITIES - OTHER","Liberal arts/Other arts and humanities",154.671065,3193,2005,5217,5217]
[1179,"Arts & Humanities","LIBERAL ARTS","Liberal arts/Other arts and humanities",151.3780549,2024,2005,5217,5217]
[211,"Arts & Humanities","ARTS & HUMANITIES - OTHER","Liberal arts/Other arts and humanities",154.61116250000001,3255,2006,5451,5451]
[1180,"Arts & Humanities","LIBERAL ARTS","Liberal arts/Other arts and humanities",151.7031107,2196,2006,5451,5451]
[212,"Arts & Humanities","ARTS & HUMANITIES - OTHER","Liberal arts/Other arts and humanities",154.95399190000001,2974,2007,4986,4986]
[1181,"Arts & Humanities","LIBERAL ARTS","Liberal arts/Other arts and humanities",151.45831250000001,2012,2007,4986,4986]
[213,"Arts & Humanities","ARTS & HUMANITIES - OTHER","Liberal arts/Other arts and humanities",154.80044100000001,2737,2008,4555,4555]
[1182,"Arts & Humanities","LIBERAL ARTS","Liberal arts/Other arts and humanities",152.09573879999999,1818,2008,4555,4555]
[214,"Arts & Humanities","ARTS & HUMANITIES - OTHER","Liberal arts/Other arts and humanities",155.02804399999999,2830,2009,4720,4720]
[1183,"Arts & Humanities","LIBERAL ARTS","Liberal arts/Other arts and humanities",151.61439999999999,1890,2009,4720,4720]
[215,"Arts & Humanities","ARTS & HUMANITIES - OTHER","Liberal arts/Other arts and humanities",155.29992920000001,2837,2010,4757,4757]
[1184,"Arts & Humanities","LIBERAL ARTS","Liberal arts/Other arts and humanities",151.93720569999999,1920,2010,4757,4757]
[216,"Arts & Humanities","ARTS & HUMANITIES - OTHER","Liberal arts/Other arts and humanities",155.59624410000001,2991,2011,4778,4778]
[1185,"Arts & Humanities","LIBERAL ARTS","Liberal arts/Other arts and humanities",152.36987070000001,1787,2011,4778,4778]
[217,"Arts & Humanities","ARTS & HUMANITIES - OTHER","Liberal arts/Other arts and humanities",155.4036213,2662,2012,4201,4201]
[1186,"Arts & Humanities","LIBERAL ARTS","Liberal arts/Other arts and humanities",151.62532640000001,1539,2012,4201,4201]
[218,"Arts & Humanities","ARTS & HUMANITIES - OTHER","Liberal arts/Other arts and humanities",155.3188102,2398,2013,3805,3805]
[1187,"Arts & Humanities","LIBERAL ARTS","Liberal arts/Other arts and humanities",151.71438800000001,1407,2013,3805,3805]
[219,"Arts & Humanities","ARTS & HUMANITIES - OTHER","Liberal arts/Other arts and humanities",154.57392100000001,2210,2014,3574,3574]
[1188,"Arts & Humanities","LIBERAL ARTS","Liberal arts/Other arts and humanities",150.87931029999999,1364,2014,3574,3574]
[220,"Arts & Humanities","ARTS & HUMANITIES - OTHER","Liberal arts/Other arts and humanities",154.20483139999999,2036,2015,3277,{"$f":"VLOOKUP(D1602&G1602,$M$2:$P$436,4)","v":3277}]
[1189,"Arts & Humanities","LIBERAL ARTS","Liberal arts/Other arts and humanities",151.39555920000001,1241,2015,3277,3277]
[221,"Arts & Humanities","ARTS & HUMANITIES - OTHER","Liberal arts/Other arts and humanities",153.4304826,2135,2016,3446,3446]
[1190,"Arts & Humanities","LIBERAL ARTS","Liberal arts/Other arts and humanities",150.9851678,1311,2016,3446,3446]
[16,"Business & Management","ADVERTISING","Marketing/Advertising/Real estate",150.0560748,107,2002,1639,1639]
[1266,"Business & Management","MARKETING","Marketing/Advertising/Real estate",149.8221083,1377,2002,1639,1639]
[1656,"Business & Management","REAL ESTATE","Marketing/Advertising/Real estate",149.0813953,86,2002,1639,1639]
[1671,"Social Sciences & Helping Professions","RECREATION AND LEISURE SERVICES","Marketing/Advertising/Real estate",148.2222222,27,2002,1639,1639]
[1686,"Business & Management","RECREATION MANAGEMENT","Marketing/Advertising/Real estate",146.952381,21,2002,1639,1639]
[1731,"Business & Management","SALES/RETAIL","Marketing/Advertising/Real estate",147,21,2002,1639,1639]
[17,"Business & Management","ADVERTISING","Marketing/Advertising/Real estate",150.5064935,155,2003,2259,2259]
[1267,"Business & Management","MARKETING","Marketing/Advertising/Real estate",150.17361840000001,1931,2003,2259,2259]
[1657,"Business & Management","REAL ESTATE","Marketing/Advertising/Real estate",151.72727269999999,100,2003,2259,2259]
[1672,"Social Sciences & Helping Professions","RECREATION AND LEISURE SERVICES","Marketing/Advertising/Real estate",145.58333329999999,24,2003,2259,2259]
[1687,"Business & Management","RECREATION MANAGEMENT","Marketing/Advertising/Real estate",147.11111109999999,18,2003,2259,2259]
[1732,"Business & Management","SALES/RETAIL","Marketing/Advertising/Real estate",146.48387099999999,31,2003,2259,2259]
[18,"Business & Management","ADVERTISING","Marketing/Advertising/Real estate",150.99431820000001,176,2004,2699,2699]
[1268,"Business & Management","MARKETING","Marketing/Advertising/Real estate",150.5764345,2295,2004,2699,2699]
[1658,"Business & Management","REAL ESTATE","Marketing/Advertising/Real estate",151.52459020000001,122,2004,2699,2699]
[1673,"Social Sciences & Helping Professions","RECREATION AND LEISURE SERVICES","Marketing/Advertising/Real estate",148.4642857,28,2004,2699,2699]
[1688,"Business & Management","RECREATION MANAGEMENT","Marketing/Advertising/Real estate",149.26315790000001,38,2004,2699,2699]
[1733,"Business & Management","SALES/RETAIL","Marketing/Advertising/Real estate",148.80000000000001,40,2004,2699,2699]
[19,"Business & Management","ADVERTISING","Marketing/Advertising/Real estate",152.26708070000001,161,2005,2887,2887]
[1269,"Business & Management","MARKETING","Marketing/Advertising/Real estate",150.73586460000001,2437,2005,2887,2887]
[1659,"Business & Management","REAL ESTATE","Marketing/Advertising/Real estate",151.292517,148,2005,2887,2887]
[1674,"Social Sciences & Helping Professions","RECREATION AND LEISURE SERVICES","Marketing/Advertising/Real estate",149.94871789999999,39,2005,2887,2887]
[1689,"Business & Management","RECREATION MANAGEMENT","Marketing/Advertising/Real estate",150.89830509999999,59,2005,2887,2887]
[1734,"Business & Management","SALES/RETAIL","Marketing/Advertising/Real estate",148.74418600000001,43,2005,2887,2887]
[20,"Business & Management","ADVERTISING","Marketing/Advertising/Real estate",150.8045113,133,2006,2685,2685]
[1270,"Business & Management","MARKETING","Marketing/Advertising/Real estate",151.17092510000001,2282,2006,2685,2685]
[1660,"Business & Management","REAL ESTATE","Marketing/Advertising/Real estate",152.3660131,155,2006,2685,2685]
[1675,"Social Sciences & Helping Professions","RECREATION AND LEISURE SERVICES","Marketing/Advertising/Real estate",150.17948720000001,39,2006,2685,2685]
[1690,"Business & Management","RECREATION MANAGEMENT","Marketing/Advertising/Real estate",149.87037040000001,54,2006,2685,2685]
[1735,"Business & Management","SALES/RETAIL","Marketing/Advertising/Real estate",148.81818179999999,22,2006,2685,2685]
[21,"Business & Management","ADVERTISING","Marketing/Advertising/Real estate",151.82568810000001,109,2007,2378,2378]
[1271,"Business & Management","MARKETING","Marketing/Advertising/Real estate",151.0269596,2012,2007,2378,2378]
[1661,"Business & Management","REAL ESTATE","Marketing/Advertising/Real estate",152.54545450000001,146,2007,2378,2378]
[1676,"Social Sciences & Helping Professions","RECREATION AND LEISURE SERVICES","Marketing/Advertising/Real estate",151.15,21,2007,2378,2378]
[1691,"Business & Management","RECREATION MANAGEMENT","Marketing/Advertising/Real estate",151.5797101,69,2007,2378,2378]
[1736,"Business & Management","SALES/RETAIL","Marketing/Advertising/Real estate",150.33333329999999,21,2007,2378,2378]
[22,"Business & Management","ADVERTISING","Marketing/Advertising/Real estate",151.8515625,128,2008,2309,2309]
[1272,"Business & Management","MARKETING","Marketing/Advertising/Real estate",151.41866669999999,1888,2008,2309,2309]
[1662,"Business & Management","REAL ESTATE","Marketing/Advertising/Real estate",153.3672316,177,2008,2309,2309]
[1677,"Social Sciences & Helping Professions","RECREATION AND LEISURE SERVICES","Marketing/Advertising/Real estate",148.47368420000001,20,2008,2309,2309]
[1692,"Business & Management","RECREATION MANAGEMENT","Marketing/Advertising/Real estate",152.13888890000001,72,2008,2309,2309]
[1737,"Business & Management","SALES/RETAIL","Marketing/Advertising/Real estate",147.79166670000001,24,2008,2309,2309]
[23,"Business & Management","ADVERTISING","Marketing/Advertising/Real estate",151.68269230000001,104,2009,2162,2162]
[1273,"Business & Management","MARKETING","Marketing/Advertising/Real estate",151.351214,1782,2009,2162,2162]
[1663,"Business & Management","REAL ESTATE","Marketing/Advertising/Real estate",153.09202450000001,163,2009,2162,2162]
[1678,"Social Sciences & Helping Professions","RECREATION AND LEISURE SERVICES","Marketing/Advertising/Real estate",152,22,2009,2162,2162]
[1693,"Business & Management","RECREATION MANAGEMENT","Marketing/Advertising/Real estate",150.30303029999999,66,2009,2162,2162]
[1738,"Business & Management","SALES/RETAIL","Marketing/Advertising/Real estate",148.4,25,2009,2162,2162]
[24,"Business & Management","ADVERTISING","Marketing/Advertising/Real estate",151.71631210000001,141,2010,2490,2490]
[1274,"Business & Management","MARKETING","Marketing/Advertising/Real estate",151.34705009999999,2029,2010,2490,2490]
[1664,"Business & Management","REAL ESTATE","Marketing/Advertising/Real estate",153.31111110000001,183,2010,2490,2490]
[1679,"Social Sciences & Helping Professions","RECREATION AND LEISURE SERVICES","Marketing/Advertising/Real estate",151.29629629999999,27,2010,2490,2490]
[1694,"Business & Management","RECREATION MANAGEMENT","Marketing/Advertising/Real estate",151.57352940000001,68,2010,2490,2490]
[1739,"Business & Management","SALES/RETAIL","Marketing/Advertising/Real estate",148.69047620000001,42,2010,2490,2490]
[25,"Business & Management","ADVERTISING","Marketing/Advertising/Real estate",151.94573639999999,129,2011,2684,2684]
[1275,"Business & Management","MARKETING","Marketing/Advertising/Real estate",151.50550459999999,2191,2011,2684,2684]
[1665,"Business & Management","REAL ESTATE","Marketing/Advertising/Real estate",153.25991189999999,230,2011,2684,2684]
[1680,"Social Sciences & Helping Professions","RECREATION AND LEISURE SERVICES","Marketing/Advertising/Real estate",153.27586210000001,29,2011,2684,2684]
[1695,"Business & Management","RECREATION MANAGEMENT","Marketing/Advertising/Real estate",152.01492540000001,67,2011,2684,2684]
[1740,"Business & Management","SALES/RETAIL","Marketing/Advertising/Real estate",150.2105263,38,2011,2684,2684]
[26,"Business & Management","ADVERTISING","Marketing/Advertising/Real estate",152.75806449999999,125,2012,2190,{"$f":"VLOOKUP(D1666&G1666,$M$2:$P$436,4)","v":2190}]
[1276,"Business & Management","MARKETING","Marketing/Advertising/Real estate",151.6465039,1807,2012,2190,2190]
[1666,"Business & Management","REAL ESTATE","Marketing/Advertising/Real estate",152.11034480000001,146,2012,2190,2190]
[1681,"Social Sciences & Helping Professions","RECREATION AND LEISURE SERVICES","Marketing/Advertising/Real estate",151.5,16,2012,2190,2190]
[1696,"Business & Management","RECREATION MANAGEMENT","Marketing/Advertising/Real estate",151.13157889999999,76,2012,2190,2190]
[1741,"Business & Management","SALES/RETAIL","Marketing/Advertising/Real estate",145.94999999999999,20,2012,2190,2190]
[27,"Business & Management","ADVERTISING","Marketing/Advertising/Real estate",151.5,97,2013,1763,1763]
[1277,"Business & Management","MARKETING","Marketing/Advertising/Real estate",151.4166085,1448,2013,1763,1763]
[1667,"Business & Management","REAL ESTATE","Marketing/Advertising/Real estate",153.317757,109,2013,1763,1763]
[1682,"Social Sciences & Helping Professions","RECREATION AND LEISURE SERVICES","Marketing/Advertising/Real estate",149.58823530000001,17,2013,1763,1763]
[1697,"Business & Management","RECREATION MANAGEMENT","Marketing/Advertising/Real estate",149.80303029999999,66,2013,1763,1763]
[1742,"Business & Management","SALES/RETAIL","Marketing/Advertising/Real estate",150.46153849999999,26,2013,1763,1763]
[28,"Business & Management","ADVERTISING","Marketing/Advertising/Real estate",151.37804879999999,84,2014,1452,1452]
[1278,"Business & Management","MARKETING","Marketing/Advertising/Real estate",150.83818489999999,1194,2014,1452,1452]
[1668,"Business & Management","REAL ESTATE","Marketing/Advertising/Real estate",151.972973,76,2014,1452,1452]
[1683,"Social Sciences & Helping Professions","RECREATION AND LEISURE SERVICES","Marketing/Advertising/Real estate",150.53846150000001,13,2014,1452,1452]
[1698,"Business & Management","RECREATION MANAGEMENT","Marketing/Advertising/Real estate",150.484375,65,2014,1452,1452]
[1743,"Business & Management","SALES/RETAIL","Marketing/Advertising/Real estate",149.69999999999999,20,2014,1452,1452]
[29,"Business & Management","ADVERTISING","Marketing/Advertising/Real estate",150.80000000000001,67,2015,1172,1172]
[1279,"Business & Management","MARKETING","Marketing/Advertising/Real estate",150.41042350000001,948,2015,1172,1172]
[1669,"Business & Management","REAL ESTATE","Marketing/Advertising/Real estate",151.75342470000001,74,2015,1172,1172]
[1684,"Social Sciences & Helping Professions","RECREATION AND LEISURE SERVICES","Marketing/Advertising/Real estate",155.66666670000001,9,2015,1172,1172]
[1699,"Business & Management","RECREATION MANAGEMENT","Marketing/Advertising/Real estate",152.2982456,57,2015,1172,1172]
[1744,"Business & Management","SALES/RETAIL","Marketing/Advertising/Real estate",149.80000000000001,17,2015,1172,1172]
[30,"Business & Management","ADVERTISING","Marketing/Advertising/Real estate",151.33783779999999,74,2016,1096,1096]
[1280,"Business & Management","MARKETING","Marketing/Advertising/Real estate",151.1138952,902,2016,1096,1096]
[1670,"Business & Management","REAL ESTATE","Marketing/Advertising/Real estate",150.52173909999999,48,2016,1096,1096]
[1685,"Social Sciences & Helping Professions","RECREATION AND LEISURE SERVICES","Marketing/Advertising/Real estate",149.5,15,2016,1096,1096]
[1700,"Business & Management","RECREATION MANAGEMENT","Marketing/Advertising/Real estate",150.42222219999999,45,2016,1096,1096]
[1745,"Business & Management","SALES/RETAIL","Marketing/Advertising/Real estate",153.18181820000001,12,2016,1096,1096]
[234,"Natural Sciences","ASTRONOMY","Math/Physics",160.08333329999999,12,2002,604,604]
[319,"Natural Sciences","BIOPHYSICS","Math/Physics",155.25,8,2002,604,604]
[1281,"Natural Sciences","MATHEMATICS","Math/Physics",158.6102564,392,2002,604,604]
[1509,"Natural Sciences","PHYSICS, GENERAL","Math/Physics",159.87096769999999,157,2002,604,604]
[1524,"Natural Sciences","PHYSICS, SPECIALIZATION","Math/Physics",159.83333329999999,24,2002,604,604]
[1867,"Natural Sciences","STATISTICS","Math/Physics",159.45454549999999,11,2002,604,604]
[235,"Natural Sciences","ASTRONOMY","Math/Physics",163.625,8,2003,812,812]
[320,"Natural Sciences","BIOPHYSICS","Math/Physics",160.27272730000001,11,2003,812,812]
[1282,"Natural Sciences","MATHEMATICS","Math/Physics",158.94021739999999,554,2003,812,812]
[1510,"Natural Sciences","PHYSICS, GENERAL","Math/Physics",160.96354170000001,193,2003,812,812]
[1525,"Natural Sciences","PHYSICS, SPECIALIZATION","Math/Physics",160.5,27,2003,812,812]
[1868,"Natural Sciences","STATISTICS","Math/Physics",159.68421050000001,19,2003,812,812]
[236,"Natural Sciences","ASTRONOMY","Math/Physics",155.42857140000001,7,2004,910,910]
[321,"Natural Sciences","BIOPHYSICS","Math/Physics",156.14285709999999,7,2004,910,910]
[869,"Natural Sciences","GEOPHYSICS","Math/Physics",157.19999999999999,5,2004,910,910]
[1283,"Natural Sciences","MATHEMATICS","Math/Physics",159.5207006,629,2004,910,910]
[1511,"Natural Sciences","PHYSICS, GENERAL","Math/Physics",160.6161137,213,2004,910,910]
[1526,"Natural Sciences","PHYSICS, SPECIALIZATION","Math/Physics",159.8846154,27,2004,910,910]
[1869,"Natural Sciences","STATISTICS","Math/Physics",156,22,2004,910,910]
[237,"Natural Sciences","ASTRONOMY","Math/Physics",165.30769230000001,13,2005,1094,1094]
[322,"Natural Sciences","BIOPHYSICS","Math/Physics",161.33333329999999,6,2005,1094,1094]
[1284,"Natural Sciences","MATHEMATICS","Math/Physics",159.47353759999999,723,2005,1094,1094]
[1512,"Natural Sciences","PHYSICS, GENERAL","Math/Physics",160.33108110000001,297,2005,1094,1094]
[1527,"Natural Sciences","PHYSICS, SPECIALIZATION","Math/Physics",158.6,25,2005,1094,1094]
[1870,"Natural Sciences","STATISTICS","Math/Physics",160.46666669999999,30,2005,1094,1094]
[238,"Natural Sciences","ASTRONOMY","Math/Physics",159.0909091,11,2006,1043,1043]
[323,"Natural Sciences","BIOPHYSICS","Math/Physics",155.33333329999999,9,2006,1043,1043]
[870,"Natural Sciences","GEOPHYSICS","Math/Physics",159.42857140000001,7,2006,1043,1043]
[1285,"Natural Sciences","MATHEMATICS","Math/Physics",160.19392189999999,694,2006,1043,1043]
[1513,"Natural Sciences","PHYSICS, GENERAL","Math/Physics",159.91505789999999,262,2006,1043,1043]
[1528,"Natural Sciences","PHYSICS, SPECIALIZATION","Math/Physics",159.2777778,36,2006,1043,1043]
[1871,"Natural Sciences","STATISTICS","Math/Physics",159.08333329999999,24,2006,1043,1043]
[239,"Natural Sciences","ASTRONOMY","Math/Physics",160.6153846,13,2007,958,958]
[324,"Natural Sciences","BIOPHYSICS","Math/Physics",154.80000000000001,5,2007,958,958]
[1286,"Natural Sciences","MATHEMATICS","Math/Physics",160.39285709999999,650,2007,958,{"$f":"VLOOKUP(D1730&G1730,$M$2:$P$436,4)","v":958}]
[1514,"Natural Sciences","PHYSICS, GENERAL","Math/Physics",161.29166670000001,242,2007,958,958]
[1529,"Natural Sciences","PHYSICS, SPECIALIZATION","Math/Physics",158.43333329999999,30,2007,958,958]
[1872,"Natural Sciences","STATISTICS","Math/Physics",159.7647059,18,2007,958,958]
[240,"Natural Sciences","ASTRONOMY","Math/Physics",159.54545450000001,11,2008,833,833]
[1287,"Natural Sciences","MATHEMATICS","Math/Physics",160.55653710000001,568,2008,833,833]
[1515,"Natural Sciences","PHYSICS, GENERAL","Math/Physics",161.67906980000001,216,2008,833,833]
[1530,"Natural Sciences","PHYSICS, SPECIALIZATION","Math/Physics",158.47368420000001,19,2008,833,833]
[1873,"Natural Sciences","STATISTICS","Math/Physics",158.68421050000001,19,2008,833,833]
[241,"Natural Sciences","ASTRONOMY","Math/Physics",164.81818179999999,11,2009,814,814]
[325,"Natural Sciences","BIOPHYSICS","Math/Physics",154.2857143,7,2009,814,814]
[1288,"Natural Sciences","MATHEMATICS","Math/Physics",160.28046420000001,520,2009,814,814]
[1516,"Natural Sciences","PHYSICS, GENERAL","Math/Physics",161.48611109999999,220,2009,814,814]
[1531,"Natural Sciences","PHYSICS, SPECIALIZATION","Math/Physics",158.19999999999999,25,2009,814,814]
[1874,"Natural Sciences","STATISTICS","Math/Physics",159.61290320000001,31,2009,814,814]
[242,"Natural Sciences","ASTRONOMY","Math/Physics",165.8,10,2010,786,786]
[326,"Natural Sciences","BIOPHYSICS","Math/Physics",158.16666670000001,6,2010,786,786]
[1289,"Natural Sciences","MATHEMATICS","Math/Physics",160.53021440000001,513,2010,786,786]
[1517,"Natural Sciences","PHYSICS, GENERAL","Math/Physics",161.2167488,204,2010,786,786]
[1532,"Natural Sciences","PHYSICS, SPECIALIZATION","Math/Physics",157.91666670000001,25,2010,786,786]
[1875,"Natural Sciences","STATISTICS","Math/Physics",161.7142857,28,2010,786,786]
[243,"Natural Sciences","ASTRONOMY","Math/Physics",166.0909091,11,2011,783,783]
[327,"Natural Sciences","BIOPHYSICS","Math/Physics",155.19999999999999,5,2011,783,783]
[1290,"Natural Sciences","MATHEMATICS","Math/Physics",161.36501899999999,527,2011,783,783]
[1518,"Natural Sciences","PHYSICS, GENERAL","Math/Physics",162.18032790000001,185,2011,783,783]
[1533,"Natural Sciences","PHYSICS, SPECIALIZATION","Math/Physics",159.2222222,27,2011,783,783]
[1876,"Natural Sciences","STATISTICS","Math/Physics",160.17857140000001,28,2011,783,783]
[244,"Natural Sciences","ASTRONOMY","Math/Physics",169.2857143,7,2012,675,675]
[1291,"Natural Sciences","MATHEMATICS","Math/Physics",161.21868370000001,471,2012,675,675]
[1519,"Natural Sciences","PHYSICS, GENERAL","Math/Physics",161.93055559999999,145,2012,675,675]
[1534,"Natural Sciences","PHYSICS, SPECIALIZATION","Math/Physics",160.4375,16,2012,675,675]
[1806,"Natural Sciences","SPACE PHYSICS","Math/Physics",154.19999999999999,5,2012,675,675]
[1877,"Natural Sciences","STATISTICS","Math/Physics",160.9032258,31,2012,675,675]
[245,"Natural Sciences","ASTRONOMY","Math/Physics",167.5,8,2013,594,594]
[871,"Natural Sciences","GEOPHYSICS","Math/Physics",155.6,5,2013,594,594]
[1292,"Natural Sciences","MATHEMATICS","Math/Physics",161.79301749999999,401,2013,594,594]
[1520,"Natural Sciences","PHYSICS, GENERAL","Math/Physics",162.0642857,141,2013,594,594]
[1535,"Natural Sciences","PHYSICS, SPECIALIZATION","Math/Physics",161.1052632,19,2013,594,594]
[1878,"Natural Sciences","STATISTICS","Math/Physics",160,20,2013,594,594]
[246,"Natural Sciences","ASTRONOMY","Math/Physics",159.6,6,2014,486,486]
[1293,"Natural Sciences","MATHEMATICS","Math/Physics",160.83911670000001,324,2014,486,486]
[1521,"Natural Sciences","PHYSICS, GENERAL","Math/Physics",161.0934579,109,2014,486,486]
[1536,"Natural Sciences","PHYSICS, SPECIALIZATION","Math/Physics",158.0625,16,2014,486,486]
[1879,"Natural Sciences","STATISTICS","Math/Physics",161.2903226,31,2014,486,486]
[247,"Natural Sciences","ASTRONOMY","Math/Physics",165.83333329999999,6,2015,453,453]
[328,"Natural Sciences","BIOPHYSICS","Math/Physics",162,5,2015,453,453]
[1294,"Natural Sciences","MATHEMATICS","Math/Physics",160.99344260000001,310,2015,453,453]
[1522,"Natural Sciences","PHYSICS, GENERAL","Math/Physics",162.01020410000001,100,2015,453,453]
[1537,"Natural Sciences","PHYSICS, SPECIALIZATION","Math/Physics",158.55555559999999,9,2015,453,453]
[1880,"Natural Sciences","STATISTICS","Math/Physics",162.33333329999999,23,2015,453,453]
[248,"Natural Sciences","ASTRONOMY","Math/Physics",161.80000000000001,5,2016,415,415]
[1295,"Natural Sciences","MATHEMATICS","Math/Physics",161.96603769999999,271,2016,415,415]
[1523,"Natural Sciences","PHYSICS, GENERAL","Math/Physics",160.4947368,97,2016,415,415]
[1538,"Natural Sciences","PHYSICS, SPECIALIZATION","Math/Physics",161.25,17,2016,415,415]
[1881,"Natural Sciences","STATISTICS","Math/Physics",164.18181820000001,25,2016,415,415]
[117,"Other","ANY AREA NOT LISTED - OTHER","NA",149.87309780000001,3716,2002,415,415]
[132,"Social Sciences & Helping Professions","ANY AREA NOT LISTED - OTHER","NA",147.385278,1288,2002,415,415]
[118,"Other","ANY AREA NOT LISTED - OTHER","NA",150.02062760000001,4592,2003,415,415]
[133,"Social Sciences & Helping Professions","ANY AREA NOT LISTED - OTHER","NA",147.2801527,1319,2003,415,415]
[119,"Other","ANY AREA NOT LISTED - OTHER","NA",150.4104174,5457,2004,415,415]
[134,"Social Sciences & Helping Professions","ANY AREA NOT LISTED - OTHER","NA",147.8446328,1424,2004,415,415]
[120,"Other","ANY AREA NOT LISTED - OTHER","NA",150.54222680000001,5861,2005,415,415]
[135,"Social Sciences & Helping Professions","ANY AREA NOT LISTED - OTHER","NA",148.6618297,1602,2005,415,415]
[121,"Other","ANY AREA NOT LISTED - OTHER","NA",150.05454230000001,5857,2006,415,415]
[136,"Social Sciences & Helping Professions","ANY AREA NOT LISTED - OTHER","NA",149.19559749999999,1604,2006,415,{"$f":"VLOOKUP(D1794&G1794,$M$2:$P$436,4)","v":415}]
[122,"Other","ANY AREA NOT LISTED - OTHER","NA",149.84889770000001,5638,2007,415,415]
[137,"Social Sciences & Helping Professions","ANY AREA NOT LISTED - OTHER","NA",148.97720459999999,1680,2007,415,415]
[123,"Other","ANY AREA NOT LISTED - OTHER","NA",149.80199099999999,5598,2008,415,415]
[138,"Social Sciences & Helping Professions","ANY AREA NOT LISTED - OTHER","NA",149.67062820000001,1776,2008,415,415]
[124,"Other","ANY AREA NOT LISTED - OTHER","NA",149.28724560000001,5559,2009,415,415]
[139,"Social Sciences & Helping Professions","ANY AREA NOT LISTED - OTHER","NA",149.51906320000001,1852,2009,415,415]
[125,"Other","ANY AREA NOT LISTED - OTHER","NA",149.77448279999999,5854,2010,415,415]
[140,"Social Sciences & Helping Professions","ANY AREA NOT LISTED - OTHER","NA",149.68450390000001,1801,2010,415,415]
[126,"Other","ANY AREA NOT LISTED - OTHER","NA",149.7493614,6320,2011,415,415]
[141,"Social Sciences & Helping Professions","ANY AREA NOT LISTED - OTHER","NA",149.65372339999999,1891,2011,415,415]
[127,"Other","ANY AREA NOT LISTED - OTHER","NA",149.39449379999999,5687,2012,415,415]
[142,"Social Sciences & Helping Professions","ANY AREA NOT LISTED - OTHER","NA",149.4539978,1836,2012,415,415]
[128,"Other","ANY AREA NOT LISTED - OTHER","NA",149.02116000000001,5366,2013,415,415]
[143,"Social Sciences & Helping Professions","ANY AREA NOT LISTED - OTHER","NA",149.1674797,1854,2013,415,415]
[129,"Other","ANY AREA NOT LISTED - OTHER","NA",148.5813034,4914,2014,415,415]
[144,"Social Sciences & Helping Professions","ANY AREA NOT LISTED - OTHER","NA",148.72511489999999,1331,2014,415,415]
[130,"Other","ANY AREA NOT LISTED - OTHER","NA",148.2125877,4545,2015,415,415]
[145,"Social Sciences & Helping Professions","ANY AREA NOT LISTED - OTHER","NA",148.2321263,1099,2015,415,415]
[131,"Other","ANY AREA NOT LISTED - OTHER","NA",147.43641450000001,5159,2016,415,415]
[146,"Social Sciences & Helping Professions","ANY AREA NOT LISTED - OTHER","NA",147.5125409,942,2016,415,415]
[1449,"Arts & Humanities","PHILOSOPHY","Philosophy/Religion",156.84582130000001,2099,2002,2625,2625]
[1701,"Arts & Humanities","RELIGION/RELIGIOUS STUDIES","Philosophy/Religion",157.05555559999999,453,2002,2625,2625]
[1889,"Arts & Humanities","THEOLOGY","Philosophy/Religion",152.86111109999999,73,2002,2625,2625]
[1450,"Arts & Humanities","PHILOSOPHY","Philosophy/Religion",157.14344259999999,2446,2003,3074,3074]
[1702,"Arts & Humanities","RELIGION/RELIGIOUS STUDIES","Philosophy/Religion",157.3449541,545,2003,3074,3074]
[1890,"Arts & Humanities","THEOLOGY","Philosophy/Religion",154.20731710000001,83,2003,3074,3074]
[1451,"Arts & Humanities","PHILOSOPHY","Philosophy/Religion",157.69518719999999,2817,2004,3469,3469]
[1703,"Arts & Humanities","RELIGION/RELIGIOUS STUDIES","Philosophy/Religion",157.647482,560,2004,3469,3469]
[1891,"Arts & Humanities","THEOLOGY","Philosophy/Religion",152.4395604,92,2004,3469,3469]
[1452,"Arts & Humanities","PHILOSOPHY","Philosophy/Religion",157.60152769999999,3158,2005,3898,3898]
[1704,"Arts & Humanities","RELIGION/RELIGIOUS STUDIES","Philosophy/Religion",157.38304550000001,639,2005,3898,3898]
[1892,"Arts & Humanities","THEOLOGY","Philosophy/Religion",153.53535350000001,101,2005,3898,3898]
[1453,"Arts & Humanities","PHILOSOPHY","Philosophy/Religion",157.85536310000001,3298,2006,4093,4093]
[1705,"Arts & Humanities","RELIGION/RELIGIOUS STUDIES","Philosophy/Religion",157.71365639999999,684,2006,4093,4093]
[1893,"Arts & Humanities","THEOLOGY","Philosophy/Religion",153.90740740000001,111,2006,4093,4093]
[1454,"Arts & Humanities","PHILOSOPHY","Philosophy/Religion",157.82329440000001,3265,2007,4012,4012]
[1706,"Arts & Humanities","RELIGION/RELIGIOUS STUDIES","Philosophy/Religion",156.9717425,638,2007,4012,4012]
[1894,"Arts & Humanities","THEOLOGY","Philosophy/Religion",156.87155960000001,109,2007,4012,4012]
[1455,"Arts & Humanities","PHILOSOPHY","Philosophy/Religion",158.03934530000001,3179,2008,3917,3917]
[1707,"Arts & Humanities","RELIGION/RELIGIOUS STUDIES","Philosophy/Religion",157.43851129999999,618,2008,3917,3917]
[1895,"Arts & Humanities","THEOLOGY","Philosophy/Religion",157.16666670000001,120,2008,3917,3917]
[1456,"Arts & Humanities","PHILOSOPHY","Philosophy/Religion",157.8463768,3111,2009,3834,3834]
[1708,"Arts & Humanities","RELIGION/RELIGIOUS STUDIES","Philosophy/Religion",157.6619048,632,2009,3834,3834]
[1896,"Arts & Humanities","THEOLOGY","Philosophy/Religion",156.20879120000001,91,2009,3834,3834]
[1457,"Arts & Humanities","PHILOSOPHY","Philosophy/Religion",158.2381379,3354,2010,4130,4130]
[1709,"Arts & Humanities","RELIGION/RELIGIOUS STUDIES","Philosophy/Religion",158.18279570000001,656,2010,4130,4130]
[1897,"Arts & Humanities","THEOLOGY","Philosophy/Religion",156.7627119,120,2010,4130,4130]
[1458,"Arts & Humanities","PHILOSOPHY","Philosophy/Religion",158.46739740000001,3564,2011,4347,4347]
[1710,"Arts & Humanities","RELIGION/RELIGIOUS STUDIES","Philosophy/Religion",158.16740089999999,684,2011,4347,4347]
[1898,"Arts & Humanities","THEOLOGY","Philosophy/Religion",155.969697,99,2011,4347,4347]
[1459,"Arts & Humanities","PHILOSOPHY","Philosophy/Religion",158.60175390000001,3312,2012,4004,4004]
[1711,"Arts & Humanities","RELIGION/RELIGIOUS STUDIES","Philosophy/Religion",158.18302829999999,602,2012,4004,4004]
[1899,"Arts & Humanities","THEOLOGY","Philosophy/Religion",156.20224719999999,90,2012,4004,4004]
[1460,"Arts & Humanities","PHILOSOPHY","Philosophy/Religion",158.35310440000001,2889,2013,3470,3470]
[1712,"Arts & Humanities","RELIGION/RELIGIOUS STUDIES","Philosophy/Religion",156.82970299999999,508,2013,3470,3470]
[1900,"Arts & Humanities","THEOLOGY","Philosophy/Religion",154.15068489999999,73,2013,3470,3470]
[1461,"Arts & Humanities","PHILOSOPHY","Philosophy/Religion",157.49120120000001,2638,2014,3135,3135]
[1713,"Arts & Humanities","RELIGION/RELIGIOUS STUDIES","Philosophy/Religion",156.91807230000001,422,2014,3135,3135]
[1901,"Arts & Humanities","THEOLOGY","Philosophy/Religion",154.95945950000001,75,2014,3135,3135]
[1462,"Arts & Humanities","PHILOSOPHY","Philosophy/Religion",158.0454163,2411,2015,2825,2825]
[1714,"Arts & Humanities","RELIGION/RELIGIOUS STUDIES","Philosophy/Religion",156.57017540000001,349,2015,2825,2825]
[1902,"Arts & Humanities","THEOLOGY","Philosophy/Religion",155.11111109999999,65,2015,2825,2825]
[1463,"Arts & Humanities","PHILOSOPHY","Philosophy/Religion",157.9682119,2294,2016,2730,2730]
[1715,"Arts & Humanities","RELIGION/RELIGIOUS STUDIES","Philosophy/Religion",156.85260120000001,352,2016,2730,{"$f":"VLOOKUP(D1858&G1858,$M$2:$P$436,4)","v":2730}]
[1903,"Arts & Humanities","THEOLOGY","Philosophy/Religion",157.01219510000001,84,2016,2730,2730]
[1554,"Social Sciences & Helping Professions","POLICY STUDIES","Political science/Policy studies",158.51578950000001,286,2002,15014,15014]
[1569,"Social Sciences & Helping Professions","POLITICAL SCIENCE","Political science/Policy studies",152.42291169999999,14728,2002,15014,15014]
[1555,"Social Sciences & Helping Professions","POLICY STUDIES","Political science/Policy studies",159.13149849999999,327,2003,16487,16487]
[1570,"Social Sciences & Helping Professions","POLITICAL SCIENCE","Political science/Policy studies",152.66313049999999,16160,2003,16487,16487]
[1556,"Social Sciences & Helping Professions","POLICY STUDIES","Political science/Policy studies",159.04986149999999,361,2004,18288,18288]
[1571,"Social Sciences & Helping Professions","POLITICAL SCIENCE","Political science/Policy studies",152.94819000000001,17927,2004,18288,18288]
[1557,"Social Sciences & Helping Professions","POLICY STUDIES","Political science/Policy studies",158.84653470000001,404,2005,19261,19261]
[1572,"Social Sciences & Helping Professions","POLITICAL SCIENCE","Political science/Policy studies",153.44294980000001,18857,2005,19261,19261]
[1558,"Social Sciences & Helping Professions","POLICY STUDIES","Political science/Policy studies",160.01822920000001,386,2006,19159,19159]
[1573,"Social Sciences & Helping Professions","POLITICAL SCIENCE","Political science/Policy studies",153.75381580000001,18773,2006,19159,19159]
[1559,"Social Sciences & Helping Professions","POLICY STUDIES","Political science/Policy studies",158.87150840000001,360,2007,18963,18963]
[1574,"Social Sciences & Helping Professions","POLITICAL SCIENCE","Political science/Policy studies",153.8864629,18603,2007,18963,18963]
[1560,"Social Sciences & Helping Professions","POLICY STUDIES","Political science/Policy studies",159.8529412,342,2008,18467,18467]
[1575,"Social Sciences & Helping Professions","POLITICAL SCIENCE","Political science/Policy studies",154.1309037,18125,2008,18467,18467]
[1561,"Social Sciences & Helping Professions","POLICY STUDIES","Political science/Policy studies",158.91139240000001,318,2009,18512,18512]
[1576,"Social Sciences & Helping Professions","POLITICAL SCIENCE","Political science/Policy studies",154.24807179999999,18194,2009,18512,18512]
[1562,"Social Sciences & Helping Professions","POLICY STUDIES","Political science/Policy studies",159.93783780000001,371,2010,19017,19017]
[1577,"Social Sciences & Helping Professions","POLITICAL SCIENCE","Political science/Policy studies",154.30002150000001,18646,2010,19017,19017]
[1563,"Social Sciences & Helping Professions","POLICY STUDIES","Political science/Policy studies",159.83554380000001,377,2011,19374,19374]
[1578,"Social Sciences & Helping Professions","POLITICAL SCIENCE","Political science/Policy studies",154.6552743,18997,2011,19374,19374]
[1564,"Social Sciences & Helping Professions","POLICY STUDIES","Political science/Policy studies",159.36416180000001,346,2012,17658,17658]
[1579,"Social Sciences & Helping Professions","POLITICAL SCIENCE","Political science/Policy studies",154.45034720000001,17312,2012,17658,17658]
[1565,"Social Sciences & Helping Professions","POLICY STUDIES","Political science/Policy studies",159.93890680000001,315,2013,15952,15952]
[1580,"Social Sciences & Helping Professions","POLITICAL SCIENCE","Political science/Policy studies",154.49701830000001,15637,2013,15952,15952]
[1566,"Social Sciences & Helping Professions","POLICY STUDIES","Political science/Policy studies",158.68150679999999,295,2014,14310,14310]
[1581,"Social Sciences & Helping Professions","POLITICAL SCIENCE","Political science/Policy studies",153.82318169999999,14015,2014,14310,14310]
[1567,"Social Sciences & Helping Professions","POLICY STUDIES","Political science/Policy studies",158.783871,316,2015,13557,13557]
[1582,"Social Sciences & Helping Professions","POLITICAL SCIENCE","Political science/Policy studies",153.8598624,13241,2015,13557,13557]
[1568,"Social Sciences & Helping Professions","POLICY STUDIES","Political science/Policy studies",159.2713755,275,2016,12968,12968]
[1583,"Social Sciences & Helping Professions","POLITICAL SCIENCE","Political science/Policy studies",153.38919480000001,12693,2016,12968,12968]
[1626,"Social Sciences & Helping Professions","PSYCHOLOGY","Psychology",152.29379599999999,5343,2002,5343,5343]
[1627,"Social Sciences & Helping Professions","PSYCHOLOGY","Psychology",152.8159368,6113,2003,6113,6113]
[1628,"Social Sciences & Helping Professions","PSYCHOLOGY","Psychology",152.86403709999999,6486,2004,6486,6486]
[1629,"Social Sciences & Helping Professions","PSYCHOLOGY","Psychology",153.0455657,6569,2005,6569,6569]
[1630,"Social Sciences & Helping Professions","PSYCHOLOGY","Psychology",153.40497049999999,6307,2006,6307,6307]
[1631,"Social Sciences & Helping Professions","PSYCHOLOGY","Psychology",153.6262917,5933,2007,5933,5933]
[1632,"Social Sciences & Helping Professions","PSYCHOLOGY","Psychology",153.60640000000001,5645,2008,5645,5645]
[1633,"Social Sciences & Helping Professions","PSYCHOLOGY","Psychology",153.2529475,5635,2009,5635,5635]
[1634,"Social Sciences & Helping Professions","PSYCHOLOGY","Psychology",153.46296620000001,5674,2010,5674,5674]
[1635,"Social Sciences & Helping Professions","PSYCHOLOGY","Psychology",153.818005,5673,2011,5673,5673]
[1636,"Social Sciences & Helping Professions","PSYCHOLOGY","Psychology",153.5351971,4999,2012,4999,4999]
[1637,"Social Sciences & Helping Professions","PSYCHOLOGY","Psychology",153.29634440000001,4649,2013,4649,4649]
[1638,"Social Sciences & Helping Professions","PSYCHOLOGY","Psychology",152.84104479999999,4086,2014,4086,4086]
[1639,"Social Sciences & Helping Professions","PSYCHOLOGY","Psychology",152.8547471,3772,2015,3772,3772]
[1640,"Social Sciences & Helping Professions","PSYCHOLOGY","Psychology",152.4600863,3778,2016,3778,3778]
[1761,"Social Sciences & Helping Professions","SOCIAL SCIENCES - OTHER","Social Sciences-Other",151.88401049999999,1535,2002,1535,1535]
[1762,"Social Sciences & Helping Professions","SOCIAL SCIENCES - OTHER","Social Sciences-Other",152.55692490000001,1717,2003,1717,1717]
[1763,"Social Sciences & Helping Professions","SOCIAL SCIENCES - OTHER","Social Sciences-Other",152.64638049999999,1568,2004,1568,1568]
[1764,"Social Sciences & Helping Professions","SOCIAL SCIENCES - OTHER","Social Sciences-Other",152.85481480000001,1356,2005,1356,1356]
[1765,"Social Sciences & Helping Professions","SOCIAL SCIENCES - OTHER","Social Sciences-Other",153.14436330000001,1243,2006,1243,1243]
[1766,"Social Sciences & Helping Professions","SOCIAL SCIENCES - OTHER","Social Sciences-Other",153.258467,1127,2007,1127,1127]
[1767,"Social Sciences & Helping Professions","SOCIAL SCIENCES - OTHER","Social Sciences-Other",153.0904007,1083,2008,1083,1083]
[1768,"Social Sciences & Helping Professions","SOCIAL SCIENCES - OTHER","Social Sciences-Other",153.66014899999999,1081,2009,1081,1081]
[1769,"Social Sciences & Helping Professions","SOCIAL SCIENCES - OTHER","Social Sciences-Other",153.39197809999999,1108,2010,1108,1108]
[1770,"Social Sciences & Helping Professions","SOCIAL SCIENCES - OTHER","Social Sciences-Other",154.31226050000001,1049,2011,1049,1049]
[1771,"Social Sciences & Helping Professions","SOCIAL SCIENCES - OTHER","Social Sciences-Other",153.91362129999999,910,2012,910,910]
[1772,"Social Sciences & Helping Professions","SOCIAL SCIENCES - OTHER","Social Sciences-Other",152.7531486,799,2013,799,799]
[1773,"Social Sciences & Helping Professions","SOCIAL SCIENCES - OTHER","Social Sciences-Other",152.5166667,676,2014,676,676]
[1774,"Social Sciences & Helping Professions","SOCIAL SCIENCES - OTHER","Social Sciences-Other",153.05271569999999,652,2015,652,652]
[1775,"Social Sciences & Helping Professions","SOCIAL SCIENCES - OTHER","Social Sciences-Other",152.89034369999999,631,2016,631,631]
[1776,"Social Sciences & Helping Professions","SOCIAL WORK","Sociology/Social work/Urban studies/Women's studies",146.08970980000001,382,2002,3690,3690]
[1791,"Social Sciences & Helping Professions","SOCIOLOGY","Sociology/Social work/Urban studies/Women's studies",150.02648780000001,2931,2002,3690,3690]
[1919,"Social Sciences & Helping Professions","URBAN STUDIES/REGIONAL PLANNING","Sociology/Social work/Urban studies/Women's studies",152.3984375,128,2002,3690,{"$f":"VLOOKUP(D1922&G1922,$M$2:$P$436,4)","v":3690}]
[1949,"Social Sciences & Helping Professions","WOMENS STUDIES","Sociology/Social work/Urban studies/Women's studies",156.340081,249,2002,3690,3690]
[1777,"Social Sciences & Helping Professions","SOCIAL WORK","Sociology/Social work/Urban studies/Women's studies",146.64850139999999,374,2003,3850,3850]
[1792,"Social Sciences & Helping Professions","SOCIOLOGY","Sociology/Social work/Urban studies/Women's studies",150.23775069999999,3062,2003,3850,3850]
[1920,"Social Sciences & Helping Professions","URBAN STUDIES/REGIONAL PLANNING","Sociology/Social work/Urban studies/Women's studies",152,144,2003,3850,3850]
[1950,"Social Sciences & Helping Professions","WOMENS STUDIES","Sociology/Social work/Urban studies/Women's studies",154.50557620000001,270,2003,3850,3850]
[1778,"Social Sciences & Helping Professions","SOCIAL WORK","Sociology/Social work/Urban studies/Women's studies",147.0982368,401,2004,4086,4086]
[1793,"Social Sciences & Helping Professions","SOCIOLOGY","Sociology/Social work/Urban studies/Women's studies",150.8385802,3263,2004,4086,4086]
[1921,"Social Sciences & Helping Professions","URBAN STUDIES/REGIONAL PLANNING","Sociology/Social work/Urban studies/Women's studies",152.88811190000001,145,2004,4086,4086]
[1951,"Social Sciences & Helping Professions","WOMENS STUDIES","Sociology/Social work/Urban studies/Women's studies",155.38043479999999,277,2004,4086,4086]
[1779,"Social Sciences & Helping Professions","SOCIAL WORK","Sociology/Social work/Urban studies/Women's studies",146.91304349999999,395,2005,4115,4115]
[1794,"Social Sciences & Helping Professions","SOCIOLOGY","Sociology/Social work/Urban studies/Women's studies",151.28737029999999,3299,2005,4115,4115]
[1922,"Social Sciences & Helping Professions","URBAN STUDIES/REGIONAL PLANNING","Sociology/Social work/Urban studies/Women's studies",153.6834532,140,2005,4115,4115]
[1952,"Social Sciences & Helping Professions","WOMENS STUDIES","Sociology/Social work/Urban studies/Women's studies",156.27598570000001,281,2005,4115,4115]
[1780,"Social Sciences & Helping Professions","SOCIAL WORK","Sociology/Social work/Urban studies/Women's studies",147.19210530000001,382,2006,3958,3958]
[1795,"Social Sciences & Helping Professions","SOCIOLOGY","Sociology/Social work/Urban studies/Women's studies",151.1202151,3177,2006,3958,3958]
[1923,"Social Sciences & Helping Professions","URBAN STUDIES/REGIONAL PLANNING","Sociology/Social work/Urban studies/Women's studies",155.1954887,133,2006,3958,3958]
[1953,"Social Sciences & Helping Professions","WOMENS STUDIES","Sociology/Social work/Urban studies/Women's studies",156.090566,266,2006,3958,3958]
[1781,"Social Sciences & Helping Professions","SOCIAL WORK","Sociology/Social work/Urban studies/Women's studies",147.63245029999999,307,2007,3852,3852]
[1796,"Social Sciences & Helping Professions","SOCIOLOGY","Sociology/Social work/Urban studies/Women's studies",151.59509199999999,3126,2007,3852,3852]
[1924,"Social Sciences & Helping Professions","URBAN STUDIES/REGIONAL PLANNING","Sociology/Social work/Urban studies/Women's studies",156.248062,130,2007,3852,3852]
[1954,"Social Sciences & Helping Professions","WOMENS STUDIES","Sociology/Social work/Urban studies/Women's studies",154.543554,289,2007,3852,3852]
[1782,"Social Sciences & Helping Professions","SOCIAL WORK","Sociology/Social work/Urban studies/Women's studies",147.7198582,285,2008,3678,3678]
[1797,"Social Sciences & Helping Professions","SOCIOLOGY","Sociology/Social work/Urban studies/Women's studies",151.5290171,3000,2008,3678,3678]
[1925,"Social Sciences & Helping Professions","URBAN STUDIES/REGIONAL PLANNING","Sociology/Social work/Urban studies/Women's studies",155.56140350000001,114,2008,3678,3678]
[1955,"Social Sciences & Helping Professions","WOMENS STUDIES","Sociology/Social work/Urban studies/Women's studies",156.32733809999999,279,2008,3678,3678]
[1783,"Social Sciences & Helping Professions","SOCIAL WORK","Sociology/Social work/Urban studies/Women's studies",148.01094889999999,277,2009,3561,3561]
[1798,"Social Sciences & Helping Professions","SOCIOLOGY","Sociology/Social work/Urban studies/Women's studies",151.6882209,2886,2009,3561,3561]
[1926,"Social Sciences & Helping Professions","URBAN STUDIES/REGIONAL PLANNING","Sociology/Social work/Urban studies/Women's studies",155.18796990000001,134,2009,3561,3561]
[1956,"Social Sciences & Helping Professions","WOMENS STUDIES","Sociology/Social work/Urban studies/Women's studies",156.47509579999999,264,2009,3561,3561]
[1784,"Social Sciences & Helping Professions","SOCIAL WORK","Sociology/Social work/Urban studies/Women's studies",147.1275862,297,2010,3643,3643]
[1799,"Social Sciences & Helping Professions","SOCIOLOGY","Sociology/Social work/Urban studies/Women's studies",151.68004120000001,2938,2010,3643,3643]
[1927,"Social Sciences & Helping Professions","URBAN STUDIES/REGIONAL PLANNING","Sociology/Social work/Urban studies/Women's studies",155.36842110000001,134,2010,3643,3643]
[1957,"Social Sciences & Helping Professions","WOMENS STUDIES","Sociology/Social work/Urban studies/Women's studies",156.0732601,274,2010,3643,3643]
[1785,"Social Sciences & Helping Professions","SOCIAL WORK","Sociology/Social work/Urban studies/Women's studies",147.62190810000001,285,2011,3584,3584]
[1800,"Social Sciences & Helping Professions","SOCIOLOGY","Sociology/Social work/Urban studies/Women's studies",151.65136649999999,2873,2011,3584,3584]
[1928,"Social Sciences & Helping Professions","URBAN STUDIES/REGIONAL PLANNING","Sociology/Social work/Urban studies/Women's studies",155.66896550000001,145,2011,3584,3584]
[1958,"Social Sciences & Helping Professions","WOMENS STUDIES","Sociology/Social work/Urban studies/Women's studies",155.21708190000001,281,2011,3584,3584]
[1786,"Social Sciences & Helping Professions","SOCIAL WORK","Sociology/Social work/Urban studies/Women's studies",147.50915749999999,274,2012,3380,3380]
[1801,"Social Sciences & Helping Professions","SOCIOLOGY","Sociology/Social work/Urban studies/Women's studies",151.29697859999999,2729,2012,3380,3380]
[1929,"Social Sciences & Helping Professions","URBAN STUDIES/REGIONAL PLANNING","Sociology/Social work/Urban studies/Women's studies",156.45263159999999,96,2012,3380,3380]
[1959,"Social Sciences & Helping Professions","WOMENS STUDIES","Sociology/Social work/Urban studies/Women's studies",154.85357139999999,281,2012,3380,3380]
[1787,"Social Sciences & Helping Professions","SOCIAL WORK","Sociology/Social work/Urban studies/Women's studies",146.74827590000001,295,2013,3125,3125]
[1802,"Social Sciences & Helping Professions","SOCIOLOGY","Sociology/Social work/Urban studies/Women's studies",151.32755839999999,2494,2013,3125,3125]
[1930,"Social Sciences & Helping Professions","URBAN STUDIES/REGIONAL PLANNING","Sociology/Social work/Urban studies/Women's studies",154.55769230000001,105,2013,3125,3125]
[1960,"Social Sciences & Helping Professions","WOMENS STUDIES","Sociology/Social work/Urban studies/Women's studies",154.66233769999999,231,2013,3125,3125]
[1788,"Social Sciences & Helping Professions","SOCIAL WORK","Sociology/Social work/Urban studies/Women's studies",146.785124,249,2014,2756,2756]
[1803,"Social Sciences & Helping Professions","SOCIOLOGY","Sociology/Social work/Urban studies/Women's studies",150.89954130000001,2224,2014,2756,2756]
[1931,"Social Sciences & Helping Professions","URBAN STUDIES/REGIONAL PLANNING","Sociology/Social work/Urban studies/Women's studies",153.98837209999999,87,2014,2756,2756]
[1961,"Social Sciences & Helping Professions","WOMENS STUDIES","Sociology/Social work/Urban studies/Women's studies",154.95360819999999,196,2014,2756,2756]
[1789,"Social Sciences & Helping Professions","SOCIAL WORK","Sociology/Social work/Urban studies/Women's studies",146.41004179999999,255,2015,2583,2583]
[1804,"Social Sciences & Helping Professions","SOCIOLOGY","Sociology/Social work/Urban studies/Women's studies",150.8395615,2044,2015,2583,2583]
[1932,"Social Sciences & Helping Professions","URBAN STUDIES/REGIONAL PLANNING","Sociology/Social work/Urban studies/Women's studies",154,82,2015,2583,2583]
[1962,"Social Sciences & Helping Professions","WOMENS STUDIES","Sociology/Social work/Urban studies/Women's studies",153.505,202,2015,2583,2583]
[1790,"Social Sciences & Helping Professions","SOCIAL WORK","Sociology/Social work/Urban studies/Women's studies",146.62249,266,2016,2601,2601]
[1805,"Social Sciences & Helping Professions","SOCIOLOGY","Sociology/Social work/Urban studies/Women's studies",150.23910889999999,2055,2016,2601,2601]
[1933,"Social Sciences & Helping Professions","URBAN STUDIES/REGIONAL PLANNING","Sociology/Social work/Urban studies/Women's studies",153.8507463,70,2016,2601,2601]
[1963,"Social Sciences & Helping Professions","WOMENS STUDIES","Sociology/Social work/Urban studies/Women's studies",155.32038829999999,210,2016,2601,2601]

{"sheet":"Filter","index":8,"n_rows":317,"n_cols":32,"rows_kept":317,"cut":false,"hidden":false,"merged":[]}
["First Author's Last Name","First Author's First Name","Second Author's Last Name","Second Author's First Name","Third Author's Last Name","Third Author's First Name","Fourth Author's Last Name","Fourth Author's First Name","Year","Title",null,null,null,"Volume","Issue","Page","personal injury and wrongful death","Base Earnings","Earnings Growth","Fringe Benefits","Personal Consumption","Household Services","Life and Work Life Expectancy","Taxes","Medical Costs","Interest Rates","Hedonic Damages","Other","employment","business valuation and lost profits","antitrust","Other"]
["Albrecht","Gary R",null,"",null,null,null,null,1991," Forecasting the earnings of a partially disabled individual"," 1(2): 50-57",{"$f":"LEFT(K2,FIND(\"(\",K2,1)-1)","v":" 1"},{"$f":"FIND(\"(\",K2,1)","v":3},{"$f":"MID(K2,2,1)","v":"1"},{"$f":"MID(K2,4,1)","v":"2"},{"$f":"MID(K2,8,8)","v":"50-57"},"Y",null,null,"Y"]
["Albrecht","Gary R",null,"",null,null,null,null,1991," Calculating the value of a closely held firm"," 1(3):1-6",{"$f":"LEFT(K3,FIND(\"(\",K3,1)-1)","v":" 1"},null,{"$f":"MID(K3,2,1)","v":"1"},{"$f":"MID(K3,4,1)","v":"3"},{"$f":"MID(K3,8,8)","v":"-6"},null,null,null,null,null,null,null,null,null,null,null,null,null,"Y"]
["Albrecht","Gary R","Wood","John H",null,null,null,null,1997," Risk and damage awards: Shortterm bonds vs  long-term bonds"," 7(1): 48-59",{"$f":"LEFT(K4,FIND(\"(\",K4,1)-1)","v":" 7"},null,{"$f":"MID(K4,2,1)","v":"7"},{"$f":"MID(K4,4,1)","v":"1"},{"$f":"MID(K4,8,8)","v":"48-59"},"Y",null,null,"Y"]
["Albrecht","Gary R",null,"",null,null,null,null,1997," The need to use risk free discount rates: Comment"," 7(1): 92-95",{"$f":"LEFT(K5,FIND(\"(\",K5,1)-1)","v":" 7"},null,{"$f":"MID(K5,2,1)","v":"7"},{"$f":"MID(K5,4,1)","v":"1"},{"$f":"MID(K5,8,8)","v":"92-95"},null,null,null,null,null,null,null,null,null,null,null,null,"Y"]
["Allman","Phillip H",null,"",null,null,null,null,1993," Four economic issues in pension valuations"," 3(2):61-68",{"$f":"LEFT(K6,FIND(\"(\",K6,1)-1)","v":" 3"},null,{"$f":"MID(K6,2,1)","v":"3"},{"$f":"MID(K6,4,1)","v":"2"},{"$f":"MID(K6,8,8)","v":"1-68"},"Y",null,null,null,"Y"]
["Amit","Sen","Gelles","Gregory M","Johnson","Walter D",null,null,2002," Structural instability in the net discount rate series based on high grade municipal bond yields"," 12(2): 87-100",{"$f":"LEFT(K7,FIND(\"(\",K7,1)-1)","v":" 12"},null,{"$f":"MID(K7,2,2)","v":"12"},{"$f":"MID(K7,5,1)","v":"2"},{"$f":"MID(K7,8,7)","v":" 87-100"},"Y",null,null,"Y"]
["Anderson","Gary",null,"",null,null,null,null,2000," Tax filing status change and economic loss in cases of wrongful death"," 10(2): 13-26",{"$f":"LEFT(K8,FIND(\"(\",K8,1)-1)","v":" 10"},null,{"$f":"MID(K8,1,3)","v":" 10"},{"$f":"MID(K8,5,1)","v":"2"},{"$f":"MID(K8,8,8)","v":" 13-26"},null,null,null,null,null,null,null,null,null,null,null,null,"Y"]
["Anderson","Gary A","Keys","James D",null,null,null,null,2007," Building Human Capital Through Education"," 14(1): 49-75",{"$f":"LEFT(K9,FIND(\"(\",K9,1)-1)","v":" 14"},null,{"$f":"MID(K9,2,2)","v":"14"},{"$f":"MID(K9,5,1)","v":"1"},{"$f":"MID(K9,8,8)","v":" 49-75"},"Y",null,"Y"]
["Anderson","Gary A",null,null,null,null,null,null,2008,"Model Variances in Assessing the Present Value of Future Medical Care"," 15(1): 1-10",{"$f":"LEFT(K10,FIND(\"(\",K10,1)-1)","v":" 15"},null,{"$f":"MID(K10,2,1)","v":"1"},{"$f":"MID(K10,4,1)","v":"("},{"$f":"MID(K10,8,8)","v":" 1-10"},null,null,null,null,null,null,null,null,null,"Y"]
["Ashraf","Javed",null,"",null,null,null,null,1991," An analysis of recent trends in determinants of earnings"," 1(3): 79-89",{"$f":"LEFT(K11,FIND(\"(\",K11,1)-1)","v":" 1"},null,{"$f":"MID(K11,2,1)","v":"1"},{"$f":"MID(K11,4,1)","v":"3"},{"$f":"MID(K11,8,8)","v":"79-89"},null,null,null,null,null,null,null,null,null,null,null,null,null,"Y"]
["Barrett","George",null,"",null,null,null,null,1991," Personal maintenance expenditure offsets in life care valuations"," 1(2): 49-60",{"$f":"LEFT(K12,FIND(\"(\",K12,1)-1)","v":" 1"},null,{"$f":"MID(K12,2,1)","v":"1"},{"$f":"MID(K12,4,1)","v":"2"},{"$f":"MID(K12,8,8)","v":"49-60"},null,null,null,null,null,null,null,null,null,null,null,null,null,"Y"]
["Benich","Joseph",null,"",null,null,null,null,1991," Determination of tax-adjusted lost income awards: Comment"," 1(2): 99-100",{"$f":"LEFT(K13,FIND(\"(\",K13,1)-1)","v":" 1"},null,{"$f":"MID(K13,2,2)","v":"1("},{"$f":"MID(K13,5,1)","v":")"},{"$f":"MID(K13,8,7)","v":"99-100"},"Y",null,null,null,null,null,null,null,null,null,null,"Y"]
["Benich","Joseph",null,"",null,null,null,null,1992," The just better (JB) method of calculating the present value of lost future income"," 2(2): 31-38",{"$f":"LEFT(K14,FIND(\"(\",K14,1)-1)","v":" 2"},null,{"$f":"MID(K14,2,1)","v":"2"},{"$f":"MID(K14,4,1)","v":"2"},{"$f":"MID(K14,8,8)","v":"31-38"},"Y",null,null,null,null,null,null,null,"Y"]
["Benich","Joseph",null,"",null,null,null,null,1995," Updated estimates of work-life expectancies based upon the increment-decrement model: Comment"," 5(3): 85-88",{"$f":"LEFT(K15,FIND(\"(\",K15,1)-1)","v":" 5"},null,{"$f":"MID(K15,2,1)","v":"5"},{"$f":"MID(K15,4,1)","v":"3"},{"$f":"MID(K15,8,8)","v":"85-88"},"Y",null,null,null,null,"Y"]
["Benich","Joseph J",null,"",null,null,null,null,1996," Alternative approaches to tax adjustments in appraising economic loss: Comment"," 6(2): 91-94",{"$f":"LEFT(K16,FIND(\"(\",K16,1)-1)","v":" 6"},null,{"$f":"MID(K16,2,1)","v":"6"},{"$f":"MID(K16,4,1)","v":"2"},{"$f":"MID(K16,8,8)","v":"91-94"},"Y",null,null,null,null,null,null,null,null,null,"Y"]
["Ben-Zion","Barry",null,"",null,null,null,null," 2001-2002"," The valuation of the loss of future pension income"," 11(3): 1-24",{"$f":"LEFT(K17,FIND(\"(\",K17,1)-1)","v":" 11"},null,{"$f":"MID(K17,2,2)","v":"11"},{"$f":"MID(K17,5,1)","v":"3"},{"$f":"MID(K17,8,7)","v":" 1-24"},"Y",null,"Y"]
["Ben-Zion","Barry",null,"",null,null,null,null,2006," Reply: The valuation of the loss of future pension income"," 13(2): 97-100",{"$f":"LEFT(K18,FIND(\"(\",K18,1)-1)","v":" 13"},null,{"$f":"MID(K18,2,2)","v":"13"},{"$f":"MID(K18,5,1)","v":"2"},{"$f":"MID(K18,8,7)","v":" 97-100"},null,null,null,null,null,null,null,null,null,null,null,null,null,null,null,"Y"]
["Bhandari","Jagdeep S",null,"",null,null,null,null,1992," Introduction to symposium"," 2(2): 55-55",{"$f":"LEFT(K19,FIND(\"(\",K19,1)-1)","v":" 2"},null,{"$f":"MID(K19,2,1)","v":"2"},{"$f":"MID(K19,4,1)","v":"2"},{"$f":"MID(K19,8,8)","v":"55-55"},"Y",null,null,null,null,"Y"]
["Bierne","Martin D","Horvitz","Sigmund A","McNerney","James E",null,null,1994," A double counting problem in estimating lost future earning capacity."," 4(2): 73-79",{"$f":"LEFT(K20,FIND(\"(\",K20,1)-1)","v":" 4"},null,{"$f":"MID(K20,2,1)","v":"4"},{"$f":"MID(K20,4,1)","v":"2"},{"$f":"MID(K20,8,8)","v":"73-79"},"Y",null,null,null,null,null,"Y"]
["Boudreaux","Denis","Ferguson","William ","Boudreaux","Philip",null,null," 1999-2000"," Analysis and valuation of closely held firms involved in business damage cases and application of certainty equivalence"," 9(3): 1-18",{"$f":"LEFT(K21,FIND(\"(\",K21,1)-1)","v":" 9"},null,{"$f":"MID(K21,2,1)","v":"9"},{"$f":"MID(K21,4,1)","v":"3"},{"$f":"MID(K21,8,8)","v":"1-18"},null,null,null,null,null,null,null,null,null,null,null,null,null,null,"Y"]
["Bowles","Tyler J","Lewis"," Cris",null,null,null,null,2000," Time-Series properties of medical care net discount rates"," 10(2): 1-12",{"$f":"LEFT(K22,FIND(\"(\",K22,1)-1)","v":" 10"},null,{"$f":"MID(K22,1,3)","v":" 10"},{"$f":"MID(K22,5,1)","v":"2"},{"$f":"MID(K22,8,8)","v":" 1-12"},"Y",null,null,"Y"]
["Bowles","Tyler J",null,"",null,null,null,null," 2002-2003"," Valuing a Small Business: Implications of Different Income Tax Models"," 12(3): 47-61",{"$f":"LEFT(K23,FIND(\"(\",K23,1)-1)","v":" 12"},null,{"$f":"MID(K23,2,2)","v":"12"},{"$f":"MID(K23,5,1)","v":"3"},{"$f":"MID(K23,8,7)","v":" 47-61"},"Y",null,null,null,null,null,"Y"]
["Bowles","Tyler J",null,"",null,null,null,null,2006," Damages under wrongful death statutes: The relevancy of a survivor’s nation of residency"," 13(3): 65-74",{"$f":"LEFT(K24,FIND(\"(\",K24,1)-1)","v":" 13"},null,{"$f":"MID(K24,2,2)","v":"13"},{"$f":"MID(K24,5,1)","v":"3"},{"$f":"MID(K24,8,8)","v":" 65-74"},"Y",null,null,null,null,null,null,null,null,"Y"]
["Bowles","Tyler J",null,null,null,null,null,null,2008,"Employment Discrimination: Distinguishing Between Equitable Remedies and Compensatory Damages"," 15(1): 11-20",{"$f":"LEFT(K25,FIND(\"(\",K25,1)-1)","v":" 15"},null,{"$f":"MID(K25,2,1)","v":"1"},{"$f":"MID(K25,4,1)","v":"("},{"$f":"MID(K25,8,8)","v":" 11-20"},"Y",null,null,null,null,null,"Y"]
["Bowles","Tyler J T","Muirhead","Chris",null,null,null,null,1993," Employment litigation: Taxation and damage awards"," 3(1): 65-70",{"$f":"LEFT(K26,FIND(\"(\",K26,1)-1)","v":" 3"},null,{"$f":"MID(K26,2,1)","v":"3"},{"$f":"MID(K26,4,1)","v":"1"},{"$f":"MID(K26,8,8)","v":"65-70"},"Y",null,null,null,null,null,null,"Y"]
["Bowles","Tyler J",null,"",null,null,null,null,1994," Wrongful discharge: The time horizon of future damages and the economic basis for damages"," 4(1): 75-82",{"$f":"LEFT(K27,FIND(\"(\",K27,1)-1)","v":" 4"},null,{"$f":"MID(K27,2,1)","v":"4"},{"$f":"MID(K27,4,1)","v":"1"},{"$f":"MID(K27,8,8)","v":"75-82"},"Y",null,null,null,null,null,null,"Y"]
["Bowles","Tyler J","Lewis","W Cris",null,null,null,null,1995," Estimating lost retirement benefits: Tax considerations"," 5(3): 59-68",{"$f":"LEFT(K28,FIND(\"(\",K28,1)-1)","v":" 5"},null,{"$f":"MID(K28,2,1)","v":"5"},{"$f":"MID(K28,4,1)","v":"3"},{"$f":"MID(K28,8,8)","v":"59-68"},"Y",null,null,"Y"]
["Bowles","Tyler J","Lewis"," Cris",null,null,null,null,"  1999-2000"," Unsettled issues in measuring lost profits"," 9(3): 19-32",{"$f":"LEFT(K29,FIND(\"(\",K29,1)-1)","v":" 9"},null,{"$f":"MID(K29,2,1)","v":"9"},{"$f":"MID(K29,4,1)","v":"3"},{"$f":"MID(K29,8,8)","v":"19-32"},"Y",null,null,"Y"]
["Bowles","Tyler J",null,"",null,null,null,null,1999," Book Review: Expert economic testimony: Reference guides for judges and attorneys"," 9(1): 81-86",{"$f":"LEFT(K30,FIND(\"(\",K30,1)-1)","v":" 9"},null,{"$f":"MID(K30,2,1)","v":"9"},{"$f":"MID(K30,4,1)","v":"1"},{"$f":"MID(K30,8,8)","v":"81-86"}]
["Bowles","Tyler O",null,null,null,null,null,null,2008,"Hindsight in Commercial Damages Analysis","14(3): 1-14",{"$f":"LEFT(K31,FIND(\"(\",K31,1)-1)","v":"14"},null,{"$f":"MID(K31,2,1)","v":"4"},{"$f":"MID(K31,4,1)","v":"3"},{"$f":"MID(K31,8,8)","v":"1-14"},"Y",null,null,null,"Y"]
["Boyd","David","Ireland","Thomas R.",null,null,null,null,2008,"History and Search Capacities of Web Sites for Legal Decisions of Interest to Forensic Economists"," 15(1): 93-104",{"$f":"LEFT(K32,FIND(\"(\",K32,1)-1)","v":" 15"},null,{"$f":"MID(K32,2,2)","v":"15"},{"$f":"MID(K32,5,1)","v":"1"},{"$f":"MID(K32,8,8)","v":" 93-104"},"Y",null,null,null,null,null,null,"Y"]
["Brand","Ronald A",null,"",null,null,null,null,1992," GATT and United States trade law: The incomplete implementation of comparative advantage theory"," 2(2): 95-110",{"$f":"LEFT(K33,FIND(\"(\",K33,1)-1)","v":" 2"},null,{"$f":"MID(K33,2,1)","v":"2"},{"$f":"MID(K33,4,1)","v":"2"},{"$f":"MID(K33,8,8)","v":"95-110"},null,null,null,null,null,null,null,null,null,null,null,null,"Y"]
["Brandi","Jay T",null,"",null,null,null,null,1992," Evaluating the estimated value of marital-Labor Input: Application of the professional human capital methodology"," 2(1): 37-48",{"$f":"LEFT(K34,FIND(\"(\",K34,1)-1)","v":" 2"},null,{"$f":"MID(K34,2,1)","v":"2"},{"$f":"MID(K34,4,1)","v":"1"},{"$f":"MID(K34,8,8)","v":"37-48"},"Y",null,null,null,null,null,null,null,null,null,"Y"]
["Brandi","Jay T",null,"",null,null,null,null,1991," Estate tax valuation and comparative discounting for he limited liability company investment fund"," 2(2): 27-46",{"$f":"LEFT(K35,FIND(\"(\",K35,1)-1)","v":" 2"},null,{"$f":"MID(K35,2,1)","v":"2"},{"$f":"MID(K35,4,1)","v":"2"},{"$f":"MID(K35,8,8)","v":"27-46"},null,null,null,null,null,null,null,null,null,null,null,"Y"]
["Breeden","Charles H.","Brush","Brian C.",null,null,null,null,2008,"The Plaintiff as Victim and Investor: Prudent Investing and the Calculation of Economic Damages","14(3): 15-41",{"$f":"LEFT(K36,FIND(\"(\",K36,1)-1)","v":"14"},null,{"$f":"MID(K36,2,1)","v":"4"},{"$f":"MID(K36,4,1)","v":"3"},{"$f":"MID(K36,8,8)","v":"15-41"},"Y",null,null,null,"Y"]
["Bremser","Wayne","Mathis","Edward J",null,null,null,null,1994," Expert witness services: Selection criteria and pitfalls"," 4(1): 61-74",{"$f":"LEFT(K37,FIND(\"(\",K37,1)-1)","v":" 4"},null,{"$f":"MID(K37,2,1)","v":"4"},{"$f":"MID(K37,4,1)","v":"1"},{"$f":"MID(K37,8,8)","v":"61-74"},"Y",null,null,null,null,null,"Y"]
["Brookshire","Michael L",null,"",null,null,null,null,2002," To deter punish but not destroy: Forensic economic analysis of jury factors for punitive damages"," 12(2): 1-26",{"$f":"LEFT(K38,FIND(\"(\",K38,1)-1)","v":" 12"},null,{"$f":"MID(K38,2,2)","v":"12"},{"$f":"MID(K38,5,1)","v":"2"},{"$f":"MID(K38,8,7)","v":" 1-26"},"Y",null,null,null,null,null,null,null,null,null,null,"Y"]
["Brookshire","Michael L","Gilbert L","Mathis",null,null,null,null,1993," The calculation and application of age-earnings adjustments"," 3(3): 23-42",{"$f":"LEFT(K39,FIND(\"(\",K39,1)-1)","v":" 3"},null,{"$f":"MID(K39,2,1)","v":"3"},{"$f":"MID(K39,4,1)","v":"3"},{"$f":"MID(K39,8,8)","v":"23-42"},"Y",null,null,null,null,null,null,"Y"]
["Brown","Ralph J",null,"",null,null,null,null,1998," Saving rate estimates for single persons by income, age, and gender"," 8(2): 49-62",{"$f":"LEFT(K40,FIND(\"(\",K40,1)-1)","v":" 8"},null,{"$f":"MID(K40,2,1)","v":"8"},{"$f":"MID(K40,4,1)","v":"2"},{"$f":"MID(K40,8,8)","v":"49-62"},"Y",null,null,null,null,null,null,null,"Y"]
["Bruce","Christopher J",null,null,null,null,null,null,2008,"A Womb with (An)other View: An Economic Analysis of the Wrongful Birth Doctrine"," 15(1): 21-33",{"$f":"LEFT(K41,FIND(\"(\",K41,1)-1)","v":" 15"},null,{"$f":"MID(K41,2,2)","v":"15"},{"$f":"MID(K41,5,1)","v":"1"},{"$f":"MID(K41,8,8)","v":" 21-33"},"Y",null,null,null,null,null,null,null,"Y"]
["Brush","Brian C",null,"",null,null,null,null," 2002-2003"," Comment: Wage Loss in Wrongful Death - A Historical Analysis"," 12(3): 81-90",{"$f":"LEFT(K42,FIND(\"(\",K42,1)-1)","v":" 12"},null,{"$f":"MID(K42,2,2)","v":"12"},{"$f":"MID(K42,5,1)","v":"3"},{"$f":"MID(K42,8,7)","v":" 81-90"},"Y",null,null,null,"Y"]
["Brush","Brian C",null,"",null,null,null,null,2003," The past as prologue: on the accuracy of using historical averages in discounting future lost earning to present value"," 13(1): 81-108",{"$f":"LEFT(K43,FIND(\"(\",K43,1)-1)","v":" 13"},null,{"$f":"MID(K43,2,2)","v":"13"},{"$f":"MID(K43,5,1)","v":"1"},{"$f":"MID(K43,8,7)","v":" 81-108"},"Y",null,null,null,null,null,null,null,"Y"]
["Brush","Brian C","Charles H","Breeden",null,null,null,null,1994," Income taxes and economic damages"," 4(2): 51-63",{"$f":"LEFT(K44,FIND(\"(\",K44,1)-1)","v":" 4"},null,{"$f":"MID(K44,2,1)","v":"4"},{"$f":"MID(K44,4,1)","v":"2"},{"$f":"MID(K44,8,8)","v":"51-63"},"Y",null,null,null,null,null,"Y"]
["Brush","Brian C","Breeden","Charles H",null,null,null,null,"  1996-1997"," A taxonomy for the treatment of taxes in cases involving lost earnings"," 6(3): 75-76",{"$f":"LEFT(K45,FIND(\"(\",K45,1)-1)","v":" 6"},null,{"$f":"MID(K45,2,1)","v":"6"},{"$f":"MID(K45,4,1)","v":"3"},{"$f":"MID(K45,8,8)","v":"75-76"},"Y",null,null,null,null,"Y"]
["Brush","Brian C","Breeden","Charles H",null,null,null,null,1996," A taxonomy for the treatment of taxes in cases involving lost earnings"," 6(2): 1-16",{"$f":"LEFT(K46,FIND(\"(\",K46,1)-1)","v":" 6"},null,{"$f":"MID(K46,2,1)","v":"6"},{"$f":"MID(K46,4,1)","v":"2"},{"$f":"MID(K46,8,8)","v":"1-16"},"Y",null,null,null,null,null,null,null,"Y"]
["Caragonne","Penelope","Ireland","homas R","Sofka","Keith",null,null,2000," Comment: An examination of historical net discount rates relative to medical care costs"," 10(2): 75-81",{"$f":"LEFT(K47,FIND(\"(\",K47,1)-1)","v":" 10"},null,{"$f":"MID(K47,1,2)","v":" 1"},{"$f":"MID(K47,5,1)","v":"2"},{"$f":"MID(K47,8,8)","v":" 75-81"},"Y",null,null,null,null,null,null,null,"Y"]
["Carlson","Alan R",null,"",null,null,null,null,1992," Discovery of expert witness income tax forms and other information. (Invited Article)"," 2(3): 67-76",{"$f":"LEFT(K48,FIND(\"(\",K48,1)-1)","v":" 2"},null,{"$f":"MID(K48,2,1)","v":"2"},{"$f":"MID(K48,4,1)","v":"3"},{"$f":"MID(K48,8,8)","v":"67-76"}]
["Casario","Michelle","Olson","Gerard T",null,null,null,null,2006," Do productivity gains result in increases in earnings? "," 13(3): 1-18",{"$f":"LEFT(K49,FIND(\"(\",K49,1)-1)","v":" 13"},null,{"$f":"MID(K49,2,2)","v":"13"},{"$f":"MID(K49,5,1)","v":"3"},{"$f":"MID(K49,8,7)","v":" 1-18"},null,null,null,null,null,null,null,null,null,null,null,null,null,null,null,"Y"]
["Cashdollar","Parker","Huie","Marsha Cope",null,null,null,null,1993," Reliability and validity of hedonic damage testimony: Judicial logic about economic science in Merrell Dow and Mercado"," 3(3): 57-72",{"$f":"LEFT(K50,FIND(\"(\",K50,1)-1)","v":" 3"},null,{"$f":"MID(K50,2,1)","v":"3"},{"$f":"MID(K50,4,1)","v":"3"},{"$f":"MID(K50,8,8)","v":"57-72"},"Y",null,null,null,null,null,"Y"]
["Cenker","William","Monastra","Carl ",null,null,null,null,1991," Business valuations: Constraints imposed by divorce"," 1(3): 7-21",{"$f":"LEFT(K51,FIND(\"(\",K51,1)-1)","v":" 1"},null,{"$f":"MID(K51,2,1)","v":"1"},{"$f":"MID(K51,4,1)","v":"3"},{"$f":"MID(K51,8,8)","v":"7-21"},"Y",null,null,"Y"]
["Christoffersen","Susan G","Frampton","Creighton ",null,null,null,null," 1997-1998"," The use of pension benefits as predictors of earning capacity"," 7(3): 35-44",{"$f":"LEFT(K52,FIND(\"(\",K52,1)-1)","v":" 7"},null,{"$f":"MID(K52,2,1)","v":"7"},{"$f":"MID(K52,4,1)","v":"3"},{"$f":"MID(K52,8,8)","v":"35-44"},null,null,null,null,null,null,null,null,null,null,null,null,null,null,"Y"]
["Ciecka","James E","Donley","Thomas ","Goldman","Jerry ",null,null," 2001-2002"," A Markov process model of work-life expectancies by educational attainment based on labor force activity in 1997-98"," 10(3): 1-22",{"$f":"LEFT(K53,FIND(\"(\",K53,1)-1)","v":" 10"},null,{"$f":"MID(K53,1,3)","v":" 10"},{"$f":"MID(K53,5,1)","v":"3"},{"$f":"MID(K53,8,8)","v":" 1-22"},"Y",null,null,null,null,null,null,null,null,null,null,"Y"]
["Ciecka","James E","Donley","homas ","Goldman","Jerry ",null,null,2000," A Markov process model of work-life expectancies for ages 66-75 based on labor market activity in 1997-98"," 10(2): 27-36",{"$f":"LEFT(K54,FIND(\"(\",K54,1)-1)","v":" 10"},null,{"$f":"MID(K54,1,3)","v":" 10"},{"$f":"MID(K54,5,1)","v":"2"},{"$f":"MID(K54,8,8)","v":" 27-36"},"Y",null,null,"Y"]
["Ciecka","James E","Rodgers","James D","Skoog","Gary R",null,null,2002," The new Gamboa tables: A critique"," 12(2): 61-86",{"$f":"LEFT(K55,FIND(\"(\",K55,1)-1)","v":" 12"},null,{"$f":"MID(K55,2,2)","v":"12"},{"$f":"MID(K55,5,1)","v":"2"},{"$f":"MID(K55,8,7)","v":" 61-86"},"Y",null,"Y"]
["Ciecka","James E.",null,null,null,null,null,null,2008,"The First Mathematically Correct Life Annuity"," 15(1): 59-63",{"$f":"LEFT(K56,FIND(\"(\",K56,1)-1)","v":" 15"},null,{"$f":"MID(K56,2,2)","v":"15"},{"$f":"MID(K56,5,1)","v":"1"},{"$f":"MID(K56,8,8)","v":" 59-63"},"Y",null,null,null,null,null,null,null,"Y"]
["Ciecka","James E.",null,null,null,null,null,null,2008,"Edmond Halley’s Life Table and Its Uses"," 15(1):  65-74",{"$f":"LEFT(K57,FIND(\"(\",K57,1)-1)","v":" 15"},null,{"$f":"MID(K57,2,2)","v":"15"},{"$f":"MID(K57,5,1)","v":"1"},{"$f":"MID(K57,8,8)","v":"  65-74"},"Y",null,null,null,null,null,"Y"]
["Ciecka","James E",null,"",null,null,null,null,1992," Why hedonic measures are irrelevant to wrongful death litigation: Comment"," 2(2): 51-54",{"$f":"LEFT(K58,FIND(\"(\",K58,1)-1)","v":" 2"},null,{"$f":"MID(K58,2,1)","v":"2"},{"$f":"MID(K58,4,1)","v":"2"},{"$f":"MID(K58,8,8)","v":"51-54"},"Y",null,null,null,null,null,"Y"]
["Ciecka","James E",null,"",null,null,null,null,1994," A survey of the structure and duration of time periods for lost earnings calculations"," 4(2): 39-50",{"$f":"LEFT(K59,FIND(\"(\",K59,1)-1)","v":" 4"},null,{"$f":"MID(K59,2,1)","v":"4"},{"$f":"MID(K59,4,1)","v":"2"},{"$f":"MID(K59,8,8)","v":"39-50"},"Y",null,null,"Y"]
["Ciecka","James E","Frigo","Mark L","Koretke","Charles H",null,null,1994," Using pension benefit guaranty corporation tables in the valuation of pension benefits: A clarification"," 4(3): 85-88",{"$f":"LEFT(K60,FIND(\"(\",K60,1)-1)","v":" 4"},null,{"$f":"MID(K60,2,1)","v":"4"},{"$f":"MID(K60,4,1)","v":"3"},{"$f":"MID(K60,8,8)","v":"85-88"},"Y",null,null,"Y"]
["Ciecka","James E","Epstein","eth","Goldman","Jerry",null,null,1995," A reply to a comment on updated work-life expectancies based upon the incrementdecrement model"," 5(3): 89-91",{"$f":"LEFT(K61,FIND(\"(\",K61,1)-1)","v":" 5"},null,{"$f":"MID(K61,2,1)","v":"5"},{"$f":"MID(K61,4,1)","v":"3"},{"$f":"MID(K61,8,8)","v":"89-91"},"Y",null,null,null,null,null,null,"Y"]
["Ciecka","James E","Epstein","Seth",null,null,null,null,1995," The use of value of life estimates in wrongful death matters: A rejoinder"," 5(3): 81-84",{"$f":"LEFT(K62,FIND(\"(\",K62,1)-1)","v":" 5"},null,{"$f":"MID(K62,2,1)","v":"5"},{"$f":"MID(K62,4,1)","v":"3"},{"$f":"MID(K62,8,8)","v":"81-84"},"Y",null,null,"Y"]
["Ciecka","James E","Donley","Thomas","Goldman","Jerry",null,null,1995," A Markov process model of work-life expectancies based on labor market activity in 1992-93"," 5(3): 17-41",{"$f":"LEFT(K63,FIND(\"(\",K63,1)-1)","v":" 5"},null,{"$f":"MID(K63,2,1)","v":"5"},{"$f":"MID(K63,4,1)","v":"3"},{"$f":"MID(K63,8,8)","v":"17-41"},"Y",null,null,"Y"]
["Ciecka","James E","Epstein","Seth","Goldman","Jerry",null,null,1995," Updated estimates of work-life expectancies based upon the increment-decrement model."," 5(1): 1-33",{"$f":"LEFT(K64,FIND(\"(\",K64,1)-1)","v":" 5"},null,{"$f":"MID(K64,2,1)","v":"5"},{"$f":"MID(K64,4,1)","v":"1"},{"$f":"MID(K64,8,8)","v":"1-33"},null,null,null,null,null,null,null,null,null,null,null,null,"Y"]
["Ciecka","James E","Epstein","Seth",null,null,null,null,1995," A comment on the use of value of life estimates in wrongful death litigation"," 5(1): 75-80",{"$f":"LEFT(K65,FIND(\"(\",K65,1)-1)","v":" 5"},null,{"$f":"MID(K65,2,1)","v":"5"},{"$f":"MID(K65,4,1)","v":"1"},{"$f":"MID(K65,8,8)","v":"75-80"},null,null,null,null,null,null,null,null,null,null,null,null,null,null,null,"Y"]
["Ciecka","James","Donley","Thomas","Goldman","Jerry",null,null,1996," Errata to \"A Markov process model of work-life expectancies based on labor market activity in 1992-93\""," 6(1): 81-85",{"$f":"LEFT(K66,FIND(\"(\",K66,1)-1)","v":" 6"},null,{"$f":"MID(K66,2,1)","v":"6"},{"$f":"MID(K66,4,1)","v":"1"},{"$f":"MID(K66,8,8)","v":"81-85"},"Y",null,null,"Y"]
["Ciecka","James E","Donley","Thomas","Goldman","Jerry",null,null,1997," A Markov process model of work-life expectancies based on labor market activity in 1994-1995"," 7(1): 2-25",{"$f":"LEFT(K67,FIND(\"(\",K67,1)-1)","v":" 7"},null,{"$f":"MID(K67,2,1)","v":"7"},{"$f":"MID(K67,4,1)","v":"1"},{"$f":"MID(K67,8,8)","v":"2-25"},"Y",null,null,null,null,null,"Y"]
["Ciecka","James E","Donley","homas ","Goldman","Jerry ",null,null," 1999-2000"," A Markov process model of work-life expectancies based on labor market activity in 1997-98"," 9(3): 33-68",{"$f":"LEFT(K68,FIND(\"(\",K68,1)-1)","v":" 9"},null,{"$f":"MID(K68,2,1)","v":"9"},{"$f":"MID(K68,4,1)","v":"3"},{"$f":"MID(K68,8,8)","v":"33-68"},null,null,null,null,null,null,null,null,null,null,"Y"]
["Ciecka","James E.",null,null,null,null,null,null,2008,"Comment on “A Note on the Steady State Assumption and Expectancy Bias,”","14 (3):81-85",{"$f":"LEFT(K69,FIND(\"(\",K69,1)-1)","v":"14 "},{"$f":"L69-1","v":13},{"$f":"MID(K69,2,1)","v":"4"},{"$f":"MID(K69,4,1)","v":"("},{"$f":"MID(K69,7,8)","v":":81-85"},null,null,null,null,null,null,null,null,null,null,null,null,null,"Y"]
["Clauretie","Terrence M",null,"",null,null,null,null," 2002-2003"," Fringe Benefits Employer-Paid Health Insurance and the Age-Earnings Cycle: Implications for Forensic Economists"," 12(3): 63-79",{"$f":"LEFT(K70,FIND(\"(\",K70,1)-1)","v":" 12"},null,{"$f":"MID(K70,2,2)","v":"12"},{"$f":"MID(K70,5,1)","v":"3"},{"$f":"MID(K70,8,7)","v":" 63-79"},"Y",null,null,null,null,"Y"]
["Clauretie","Terrence M",null,"",null,null,null,null,2003," Response: Response to Tom Ireland's Comment on my Book Review of the New Work Life Expectancy Table"," 13(1): 129-130",{"$f":"LEFT(K71,FIND(\"(\",K71,1)-1)","v":" 13"},null,{"$f":"MID(K71,2,2)","v":"13"},{"$f":"MID(K71,5,1)","v":"1"},{"$f":"MID(K71,8,7)","v":" 129-13"},"Y",null,null,null,null,null,null,null,"Y"]
["Clauretie","Terrence M",null,"",null,null,null,null,2003," Quantification of the effect of worker disability on the probability of participation and employment"," 13(1): 39-64",{"$f":"LEFT(K72,FIND(\"(\",K72,1)-1)","v":" 13"},null,{"$f":"MID(K72,2,2)","v":"13"},{"$f":"MID(K72,5,1)","v":"1"},{"$f":"MID(K72,8,7)","v":" 39-64"},null,null,null,null,null,null,null,null,null,null,null,null,null,null,null,"Y"]
["Clauretie","Terrence M",null,"",null,null,null,null,2007," A Note on the Relationship between Overtime Work and Age"," 14(1): 23-32",{"$f":"LEFT(K73,FIND(\"(\",K73,1)-1)","v":" 14"},null,{"$f":"MID(K73,2,2)","v":"14"},{"$f":"MID(K73,5,1)","v":"1"},{"$f":"MID(K73,8,8)","v":" 23-32"},"Y",null,null,null,null,null,"Y"]
["Clauretie","Terrence M","Ray","Clarence G",null,null,null,null,"  1996-1997"," A note on quantifying the tax advantage of structured versus lump-sum settlements"," 6(3): 63-70",{"$f":"LEFT(K74,FIND(\"(\",K74,1)-1)","v":" 6"},null,{"$f":"MID(K74,2,1)","v":"6"},{"$f":"MID(K74,4,1)","v":"3"},{"$f":"MID(K74,8,8)","v":"63-70"},null,null,null,null,null,null,null,null,null,null,null,null,null,"Y"]
["Clauterie","Terrence M",null,"",null,null,null,null,2001," Book Review: The new work-life expectancy tables  2002 Edition"," 11(2): 105-108",{"$f":"LEFT(K75,FIND(\"(\",K75,1)-1)","v":" 11"},null,{"$f":"MID(K75,2,2)","v":"11"},{"$f":"MID(K75,5,1)","v":"2"},{"$f":"MID(K75,8,7)","v":" 105-10"},"Y",null,null,null,null,null,"Y"]
["Clauterie","Terrence M",null,"",null,null,null,null," 1997-1998"," Book Review: The new work-life expectancy tables: 1998"," 7(3): 75-76",{"$f":"LEFT(K76,FIND(\"(\",K76,1)-1)","v":" 7"},null,{"$f":"MID(K76,2,1)","v":"7"},{"$f":"MID(K76,4,1)","v":"3"},{"$f":"MID(K76,8,8)","v":"75-76"},"Y",null,null,null,null,null,null,null,null,null,"Y"]
["Colella","Francis J","Ireland","Thomas R",null,null,null,null,1998," Neutrality and advocacy: A challenge for forensic economics"," 8(1): 71-88",{"$f":"LEFT(K77,FIND(\"(\",K77,1)-1)","v":" 8"},null,{"$f":"MID(K77,2,1)","v":"8"},{"$f":"MID(K77,4,1)","v":"1"},{"$f":"MID(K77,8,8)","v":"71-88"},"Y",null,null,null,null,null,null,null,null,null,null,null,"Y"]
["Conley","Bryan C",null,"",null,null,null,null,2003," Widow's loses and husband's self-consumption during the retirement years"," 13(1): 1-38",{"$f":"LEFT(K78,FIND(\"(\",K78,1)-1)","v":" 13"},null,{"$f":"MID(K78,2,2)","v":"13"},{"$f":"MID(K78,5,1)","v":"1"},{"$f":"MID(K78,8,7)","v":" 1-38"},"Y",null,"Y"]
["Conley","Bryan C",null,"",null,null,null,null," 1998-1999"," Self-Consumption and children's losses in the death of a single parent"," 8(3): 49-66",{"$f":"LEFT(K79,FIND(\"(\",K79,1)-1)","v":" 8"},null,{"$f":"MID(K79,2,1)","v":"8"},{"$f":"MID(K79,4,1)","v":"3"},{"$f":"MID(K79,8,8)","v":"49-66"},null,null,null,null,null,null,null,null,null,null,null,null,null,null,null,"Y"]
["Conley","Bryan C",null,"",null,null,null,null,1999," Response to Tom Ireland's comment on \"Self- Consumption and Children's Losses in the Death of a Single Parent\""," 9(2): 75-80",{"$f":"LEFT(K80,FIND(\"(\",K80,1)-1)","v":" 9"},null,{"$f":"MID(K80,2,1)","v":"9"},{"$f":"MID(K80,4,1)","v":"2"},{"$f":"MID(K80,8,8)","v":"75-80"},null,null,null,null,null,null,null,null,null,null,null,null,null,"Y"]
["Conley","Bryan C",null,"",null,null,null,null,1999," Self-Consumption and children's losses in the death of a single parent"," 9(2): 81-81",{"$f":"LEFT(K81,FIND(\"(\",K81,1)-1)","v":" 9"},null,{"$f":"MID(K81,2,1)","v":"9"},{"$f":"MID(K81,4,1)","v":"2"},{"$f":"MID(K81,8,8)","v":"81-81"}]
["Cooter","Robert D",null,"",null,null,null,null,1992," Organization as property: Economic analysis of property law applied to privatization"," 2(3): 77-102",{"$f":"LEFT(K82,FIND(\"(\",K82,1)-1)","v":" 2"},null,{"$f":"MID(K82,2,1)","v":"2"},{"$f":"MID(K82,4,1)","v":"3"},{"$f":"MID(K82,8,8)","v":"77-102"},null,null,null,null,null,null,null,null,null,null,null,null,null,null,null,"Y"]
["Dawson","Peter C",null,"",null,null,null,null,2007," The Economics of Valuing Covenants Not to Compete Under the Fair Market Value Standard"," 14(2): 25-60",{"$f":"LEFT(K83,FIND(\"(\",K83,1)-1)","v":" 14"},null,{"$f":"MID(K83,2,2)","v":"14"},{"$f":"MID(K83,5,1)","v":"2"},{"$f":"MID(K83,8,7)","v":" 25-60"},null,null,null,null,null,null,null,null,null,null,null,null,"Y"]
["Dawson","Peter C.",null,null,null,null,null,null,2008,"Errata  “The Economics of Valuing Covenants Not to\nCompete Under the Fair Market Value Standard”"," 15(1): 105-113",{"$f":"LEFT(K84,FIND(\"(\",K84,1)-1)","v":" 15"},null,{"$f":"MID(K84,2,2)","v":"15"},{"$f":"MID(K84,5,1)","v":"1"},{"$f":"MID(K84,8,8)","v":" 105-113"},"Y",null,null,null,null,null,null,null,null,"Y"]
["Daymont","Thomas N",null,"",null,null,null,null," 2001-2002"," The effects of job displacement on postdisplacement earnings"," 11(3): 39-52",{"$f":"LEFT(K85,FIND(\"(\",K85,1)-1)","v":" 11"},null,{"$f":"MID(K85,2,2)","v":"11"},{"$f":"MID(K85,5,1)","v":"3"},{"$f":"MID(K85,8,7)","v":" 39-52"},null,null,null,null,null,null,null,null,null,null,null,null,null,"Y"]
["Depperschmidt","Thomas O",null,"",null,null,null,null,1991," Calculating the personal expenditure deduction in wrongful death awards"," 1(1): 5-10",{"$f":"LEFT(K86,FIND(\"(\",K86,1)-1)","v":" 1"},null,{"$f":"MID(K86,2,1)","v":"1"},{"$f":"MID(K86,4,1)","v":"1"},{"$f":"MID(K86,8,8)","v":"5-10"},null,null,null,null,null,null,null,null,null,null,null,null,"Y"]
["Depperschmidt","Thomas O",null,"",null,null,null,null,1992," Judicial attitudes on hedonic damages: A door only partially opened in Sherrod v. Berry, Fischer, and Charles C"," 2(1): 25-36",{"$f":"LEFT(K87,FIND(\"(\",K87,1)-1)","v":" 2"},null,{"$f":"MID(K87,2,1)","v":"2"},{"$f":"MID(K87,4,1)","v":"1"},{"$f":"MID(K87,8,8)","v":"25-36"},"Y",null,null,null,null,null,null,null,null,"Y"]
["Depperschmidt","Thomas O",null,"",null,null,null,null,1992," On the integrity of forensic economics"," 2(1): 67-84",{"$f":"LEFT(K88,FIND(\"(\",K88,1)-1)","v":" 2"},null,{"$f":"MID(K88,2,1)","v":"2"},{"$f":"MID(K88,4,1)","v":"1"},{"$f":"MID(K88,8,8)","v":"67-84"},null,null,null,null,null,null,null,null,null,null,null,null,null,"Y"]
["Depperschmidt","Thomas O",null,"",null,null,null,null,1993," Meeting the defense challenge to the earning power of a lump sum award"," 3(1): 89-96",{"$f":"LEFT(K89,FIND(\"(\",K89,1)-1)","v":" 3"},null,{"$f":"MID(K89,2,1)","v":"3"},{"$f":"MID(K89,4,1)","v":"1"},{"$f":"MID(K89,8,8)","v":"89-96"},"Y","Y"]
["Depperschmidt","Thomas O",null,"",null,null,null,null,1994," Unintended consequences and perverse effects in forensic economic award calculations"," 4(2): 65-72",{"$f":"LEFT(K90,FIND(\"(\",K90,1)-1)","v":" 4"},null,{"$f":"MID(K90,2,1)","v":"4"},{"$f":"MID(K90,4,1)","v":"2"},{"$f":"MID(K90,8,8)","v":"65-72"},"Y",null,null,null,null,null,"Y"]
["Depperschmidt","Thomas O",null,"",null,null,null,null," 1997-1998"," A law and economics perspective on the personal consumption deduction in wrongful death litigation"," 7(3): 1-22",{"$f":"LEFT(K91,FIND(\"(\",K91,1)-1)","v":" 7"},null,{"$f":"MID(K91,2,1)","v":"7"},{"$f":"MID(K91,4,1)","v":"3"},{"$f":"MID(K91,8,8)","v":"1-22"},"Y",null,null,"Y"]
["DiGabriele","James A",null,"",null,null,null,null,2006," An empirical walk down valuation way: Are the valuation methods of closely held companies chosen by the courts a function of the type of case and level of court? 13(3): 39-64"," 13(3): 39-64",{"$f":"LEFT(K92,FIND(\"(\",K92,1)-1)","v":" 13"},null,{"$f":"MID(K92,2,2)","v":"13"},{"$f":"MID(K92,5,1)","v":"3"},{"$f":"MID(K92,8,7)","v":" 39-64"},"Y",null,null,null,null,null,null,null,null,null,null,"Y"]
["Dinneen","Terrence B",null,"",null,null,null,null,1997," Book Review: Internet disability resources ‘98"," 7(2): 83-86",{"$f":"LEFT(K93,FIND(\"(\",K93,1)-1)","v":" 7"},null,{"$f":"MID(K93,2,1)","v":"7"},{"$f":"MID(K93,4,1)","v":"2"},{"$f":"MID(K93,8,8)","v":"83-86"},"Y",null,null,"Y"]
["Dulaney","Ronald A",null,"",null,null,null,null,1991," Estimating decedents' consumption expenditures in wrongful death actions: Some refinements"," 1(2): 94-98",{"$f":"LEFT(K94,FIND(\"(\",K94,1)-1)","v":" 1"},null,{"$f":"MID(K94,2,1)","v":"1"},{"$f":"MID(K94,4,1)","v":"2"},{"$f":"MID(K94,8,8)","v":"94-98"},"Y",null,null,null,null,null,null,null,null,"Y"]
["Einhorn","Henry","Hays Gorey Jr","",null,null,null,null,1991," Antitrust conspiracy: The economist's role in detection prevention and relief"," 1(1): 19-34",{"$f":"LEFT(K95,FIND(\"(\",K95,1)-1)","v":" 1"},null,{"$f":"MID(K95,2,1)","v":"1"},{"$f":"MID(K95,4,1)","v":"1"},{"$f":"MID(K95,8,8)","v":"19-34"},"Y",null,null,null,null,null,null,null,null,"Y"]
["Falero","Frank",null,"",null,null,null,null,1996," Wage loss in wrongful death? A historical analysis"," 6(1): 53-67",{"$f":"LEFT(K96,FIND(\"(\",K96,1)-1)","v":" 6"},null,{"$f":"MID(K96,2,1)","v":"6"},{"$f":"MID(K96,4,1)","v":"1"},{"$f":"MID(K96,8,8)","v":"53-67"},"Y",null,null,"Y"]
["Fischer","Charles C",null,"",null,null,null,null,1991," Forensic economics and the hedonic value of life"," 1(2): 12-30",{"$f":"LEFT(K97,FIND(\"(\",K97,1)-1)","v":" 1"},null,{"$f":"MID(K97,2,1)","v":"1"},{"$f":"MID(K97,4,1)","v":"2"},{"$f":"MID(K97,8,8)","v":"12-30"}]
["Fischer","Charles C",null,"",null,null,null,null,1993," Measuring household production: Methodological considerations and current practice"," 3(1): 15-32",{"$f":"LEFT(K98,FIND(\"(\",K98,1)-1)","v":" 3"},null,{"$f":"MID(K98,2,1)","v":"3"},{"$f":"MID(K98,4,1)","v":"1"},{"$f":"MID(K98,8,8)","v":"15-32"},"Y",null,null,null,"Y"]
["Fjeldsted","Boyd L",null,"",null,null,null,null,2000," A nontrivial (though seemingly not uncommon) error in calculating the discount rate used to reduce future losses to present value"," 10(1): 73-80",{"$f":"LEFT(K99,FIND(\"(\",K99,1)-1)","v":" 10"},null,{"$f":"MID(K99,1,3)","v":" 10"},{"$f":"MID(K99,5,1)","v":"1"},{"$f":"MID(K99,8,8)","v":" 73-80"},"Y","Y"]
["Fjeldsted","Boyd",null,"",null,null,null,null,2006," Further Comment: The valuation of the loss of future pension income"," 13(2): 101-104",{"$f":"LEFT(K100,FIND(\"(\",K100,1)-1)","v":" 13"},null,{"$f":"MID(K100,2,2)","v":"13"},{"$f":"MID(K100,5,1)","v":"2"},{"$f":"MID(K100,8,8)","v":" 101-104"},"Y",null,null,null,null,null,"Y"]
["Fort","Rodney","Rosenman","Robert",null,null,null,null,1995," Rethinking the value of lost health"," 5(1): 63-73",{"$f":"LEFT(K101,FIND(\"(\",K101,1)-1)","v":" 5"},null,{"$f":"MID(K101,2,1)","v":"5"},{"$f":"MID(K101,4,1)","v":"1"},{"$f":"MID(K101,8,8)","v":"63-73"},"Y",null,null,"Y"]
["Franz","Wolfgang","Maglietti","Frank","Kalich","Clint",null,null,1992," Calculating the present value of future fringe benefits: What net discount rate to use. "," 2(1): 55-66",{"$f":"LEFT(K102,FIND(\"(\",K102,1)-1)","v":" 2"},null,{"$f":"MID(K102,2,1)","v":"2"},{"$f":"MID(K102,4,1)","v":"1"},{"$f":"MID(K102,8,8)","v":"55-66"},"Y",null,null,null,null,null,null,null,"Y"]
["Franz","Wolfgang W",null,"",null,null,null,null," 1996-1997"," Valuing the marital portion in defined benefit plans in dissolution cases consistent with the concept of community property"," 6(3): 39-54",{"$f":"LEFT(K103,FIND(\"(\",K103,1)-1)","v":" 6"},null,{"$f":"MID(K103,2,1)","v":"6"},{"$f":"MID(K103,4,1)","v":"3"},{"$f":"MID(K103,8,8)","v":"39-54"},"Y",null,null,null,null,null,null,"Y"]
["Frasca","Ralph R",null,"",null,null,null,null,2002," An economic model for calculating prospective inheritance"," 12(1): 83-98",{"$f":"LEFT(K104,FIND(\"(\",K104,1)-1)","v":" 12"},null,{"$f":"MID(K104,2,2)","v":"12"},{"$f":"MID(K104,5,1)","v":"1"},{"$f":"MID(K104,8,7)","v":" 83-98"},null,null,null,null,null,null,null,null,null,null,null,null,null,"Y"]
["Fuerman","Ross D",null,"",null,null,null,null,1997," Naming auditor defendants in securities class actions"," 7(1): 72-91",{"$f":"LEFT(K105,FIND(\"(\",K105,1)-1)","v":" 7"},null,{"$f":"MID(K105,2,1)","v":"7"},{"$f":"MID(K105,4,1)","v":"1"},{"$f":"MID(K105,8,8)","v":"72-91"},null,null,null,null,null,null,null,null,null,null,null,null,null,null,null,"Y"]
["Gafford","Wade W",null,"",null,null,null,null,1997," Qualifications of experts in valuing economic damages in personal injury and wrongful death cases","7(2): 59-82",{"$f":"LEFT(K106,FIND(\"(\",K106,1)-1)","v":"7"},{"$f":"L106-1","v":6},{"$f":"MID(K106,2,1)","v":"("},{"$f":"MID(K106,4,1)","v":")"},{"$f":"MID(K106,8,8)","v":"9-82"},"Y","Y"]
["Gann","Carl",null,"",null,null,null,null," 2001-2002"," Vocational experts in employment case"," 11(3): 53- 68",{"$f":"LEFT(K107,FIND(\"(\",K107,1)-1)","v":" 11"},null,{"$f":"MID(K107,2,2)","v":"11"},{"$f":"MID(K107,5,1)","v":"3"},{"$f":"MID(K107,8,7)","v":" 53- 68"},null,null,null,null,null,null,null,null,null,null,null,null,null,null,null,"Y"]
["Gaughan","Patrick","Lerman","Paul","Manley","Donald",null,null,1993," Measuring damages resulting from lost functionality of systems"," 3(2): 11-24",{"$f":"LEFT(K108,FIND(\"(\",K108,1)-1)","v":" 3"},null,{"$f":"MID(K108,2,1)","v":"3"},{"$f":"MID(K108,4,1)","v":"2"},{"$f":"MID(K108,8,8)","v":"11-24"},"Y",null,null,null,null,null,null,"Y"]
["Gelles","Gregory M","Johnson","Walter D",null,null,null,null,1996," Justifying utilization of the total offset method: An opposing comment"," 6(1): 69-74",{"$f":"LEFT(K109,FIND(\"(\",K109,1)-1)","v":" 6"},null,{"$f":"MID(K109,2,1)","v":"6"},{"$f":"MID(K109,4,1)","v":"1"},{"$f":"MID(K109,8,8)","v":"69-74"},null,null,null,null,null,null,null,null,null,null,null,null,null,"Y"]
["Gelman","Bruce M","Mathis","Edward J",null,null,null,null,1991," Pensions as marital assets: A summary of the issues"," 1(3): 22-32",{"$f":"LEFT(K110,FIND(\"(\",K110,1)-1)","v":" 1"},null,{"$f":"MID(K110,2,1)","v":"1"},{"$f":"MID(K110,4,1)","v":"3"},{"$f":"MID(K110,8,8)","v":"22-32"},"Y",null,null,null,null,null,"Y"]
["Gilbert","Roy F","Ireland","Thomas R",null,null,null,null,1991," Projecting personal injury losses with an experience-based model of adjustments to the work-life cycle"," 1(1): 1-25",{"$f":"LEFT(K111,FIND(\"(\",K111,1)-1)","v":" 1"},null,{"$f":"MID(K111,2,1)","v":"1"},{"$f":"MID(K111,4,1)","v":"1"},{"$f":"MID(K111,8,8)","v":"1-25"},"Y",null,null,null,"Y"]
["Gilbert","Roy F",null,"",null,null,null,null,1991," Forensic discount rates"," 1(3): 40-53",{"$f":"LEFT(K112,FIND(\"(\",K112,1)-1)","v":" 1"},null,{"$f":"MID(K112,2,1)","v":"1"},{"$f":"MID(K112,4,1)","v":"3"},{"$f":"MID(K112,8,8)","v":"40-53"},"Y",null,null,"Y"]
["Gilbert","Roy F",null,"",null,null,null,null,1992," How Economists can help in litigation involving personal injury, death or discrimination: Additional comments and suggestions for analysis"," 2(3): 63-66",{"$f":"LEFT(K113,FIND(\"(\",K113,1)-1)","v":" 2"},null,{"$f":"MID(K113,2,1)","v":"2"},{"$f":"MID(K113,4,1)","v":"3"},{"$f":"MID(K113,8,8)","v":"63-66"},"Y",null,null,null,null,null,null,null,"Y"]
["Gilbert","Roy F",null,"",null,null,null,null,1994," Estimates of earnings growth rates based on earnings profiles"," 4(2): 1-17",{"$f":"LEFT(K114,FIND(\"(\",K114,1)-1)","v":" 4"},null,{"$f":"MID(K114,2,1)","v":"4"},{"$f":"MID(K114,4,1)","v":"2"},{"$f":"MID(K114,8,8)","v":"1-17"},"Y",null,null,null,null,null,null,null,"Y"]
["Gilbert","Roy F",null,"",null,null,null,null,1994," The application of hedonic models to personal Injury litigation"," 4(3): 13-26",{"$f":"LEFT(K115,FIND(\"(\",K115,1)-1)","v":" 4"},null,{"$f":"MID(K115,2,1)","v":"4"},{"$f":"MID(K115,4,1)","v":"3"},{"$f":"MID(K115,8,8)","v":"13-26"},"Y",null,null,null,null,null,null,null,null,null,"Y"]
["Gilbert","Roy F",null,"",null,null,null,null,1995," A reply to \"The application of hedonic models to personal injury litigation: Comment.\""," 5(1): 87-90",{"$f":"LEFT(K116,FIND(\"(\",K116,1)-1)","v":" 5"},null,{"$f":"MID(K116,2,1)","v":"5"},{"$f":"MID(K116,4,1)","v":"1"},{"$f":"MID(K116,8,8)","v":"87-90"},"Y",null,"Y"]
["Gilbert","Roy F",null,"",null,null,null,null,1995," A Comment on the use of value of life estimates in wrongful death litigation: A reply"," 5(2): 85-92",{"$f":"LEFT(K117,FIND(\"(\",K117,1)-1)","v":" 5"},null,{"$f":"MID(K117,2,1)","v":"5"},{"$f":"MID(K117,4,1)","v":"2"},{"$f":"MID(K117,8,8)","v":"85-92"},"Y",null,null,null,null,null,null,null,null,null,"Y"]
["Gilbreath","Kent","Powers","Stephanie ",null,null,null," ",2006," Starting Salaries of College Graduates"," 13(2): 79-96",{"$f":"LEFT(K118,FIND(\"(\",K118,1)-1)","v":" 13"},null,{"$f":"MID(K118,2,2)","v":"13"},{"$f":"MID(K118,5,1)","v":"2"},{"$f":"MID(K118,8,8)","v":" 79-96"},null,null,null,null,null,null,null,null,null,null,null,null,"Y"]
["Greco","Anthony",null,"",null,null,null,null,1991," U.S. supreme court's decision in Business Electronics v. Sharp: A victory for vertical price fixing"," 1(2): 38-49",{"$f":"LEFT(K119,FIND(\"(\",K119,1)-1)","v":" 1"},null,{"$f":"MID(K119,2,1)","v":"1"},{"$f":"MID(K119,4,1)","v":"2"},{"$f":"MID(K119,8,8)","v":"38-49"},"Y","Y"]
["Greco","Anthony J",null,"",null,null,null,null,2006," Professional fees with collaborative divorce resolution: The evidence to date"," 13(3): 75-88",{"$f":"LEFT(K120,FIND(\"(\",K120,1)-1)","v":" 13"},null,{"$f":"MID(K120,2,2)","v":"13"},{"$f":"MID(K120,5,1)","v":"3"},{"$f":"MID(K120,8,8)","v":" 75-88"},"Y",null,null,null,"Y"]
["Greco","Anthony",null,"",null,null,null,null,1992," The recent state of antitrust enforcement activity"," 2(3): 25-48",{"$f":"LEFT(K121,FIND(\"(\",K121,1)-1)","v":" 2"},null,{"$f":"MID(K121,2,1)","v":"2"},{"$f":"MID(K121,4,1)","v":"3"},{"$f":"MID(K121,8,8)","v":"25-48"},null,null,null,null,null,null,null,null,null,null,null,null,null,"Y"]
["Grier","Paul",null,"",null,null,null,null,1994," Establishing upper and lower limits for settlement negotiations in Rule 10b-5 class action litigation."," 4(3): 1-11",{"$f":"LEFT(K122,FIND(\"(\",K122,1)-1)","v":" 4"},null,{"$f":"MID(K122,2,1)","v":"4"},{"$f":"MID(K122,4,1)","v":"3"},{"$f":"MID(K122,8,8)","v":"1-11"},"Y",null,null,null,null,null,"Y"]
["Hachman","Frank","Feldsted"," Boyd ",null,null,null,null,2006," Using Census Bureau calculations of median earnings to infer age-earnings profiles: A cautionary note"," 13(3): 19-38",{"$f":"LEFT(K123,FIND(\"(\",K123,1)-1)","v":" 13"},null,{"$f":"MID(K123,2,2)","v":"13"},{"$f":"MID(K123,5,1)","v":"3"},{"$f":"MID(K123,8,7)","v":" 19-38"},"Y",null,null,null,null,null,null,null,null,"Y"]
["Hale","Thomas W.",null,null,null,null,null,null,2008,"Errata  “Development of the New Disability Questions for the\nCPS and What They Can Tell Us About the Employment Status of\nPeople with Disabilities”"," 15(1): 115",{"$f":"LEFT(K124,FIND(\"(\",K124,1)-1)","v":" 15"},null,{"$f":"MID(K124,2,2)","v":"15"},{"$f":"MID(K124,5,1)","v":"1"},{"$f":"MID(K124,8,8)","v":" 115"},"Y",null,null,null,null,null,null,null,null,"Y"]
["Hale","Thomas W.",null,null,null,null,null,null,2008,"Development of the New Disability Questions for the CPS and What They Can Tell Us About the Employment Status of People with Disabilities","14 (3):101-110",{"$f":"LEFT(K125,FIND(\"(\",K125,1)-1)","v":"14 "},null,{"$f":"MID(K125,2,1)","v":"4"},{"$f":"MID(K125,4,1)","v":"("},{"$f":"MID(K125,8,8)","v":"101-110"},null,null,"Y"]
["Hanke","Steve H","Walters","Stephen J K",null,null,null,null,1995," Tax appraisal in evolving industries: An econometric approach."," 5(2): 43-55",{"$f":"LEFT(K126,FIND(\"(\",K126,1)-1)","v":" 5"},null,{"$f":"MID(K126,2,1)","v":"5"},{"$f":"MID(K126,4,1)","v":"2"},{"$f":"MID(K126,8,8)","v":"43-55"},null,null,null,null,null,null,null,null,null,null,null,null,null,null,null,"Y"]
["Hanson","Richard X",null,"",null,null,null,null,1991," Future transactions in pension valuation"," 1(2): 66-73",{"$f":"LEFT(K127,FIND(\"(\",K127,1)-1)","v":" 1"},null,{"$f":"MID(K127,2,1)","v":"1"},{"$f":"MID(K127,4,1)","v":"2"},{"$f":"MID(K127,8,8)","v":"66-73"},null,null,null,null,null,null,null,null,null,null,null,null,null,"Y"]
["Hardy Jr","William E",null,"",null,null,null,null,1993," Use of national opinion research center data when estimating lost earnings capacity of an injured child. "," 3(3): 73- 86",{"$f":"LEFT(K128,FIND(\"(\",K128,1)-1)","v":" 3"},null,{"$f":"MID(K128,2,1)","v":"3"},{"$f":"MID(K128,4,1)","v":"3"},{"$f":"MID(K128,8,8)","v":"73- 86"},null,null,null,null,null,null,null,null,null,null,null,null,null,null,null,"Y"]
["Harrant","Valerie",null,"",null,null,null,null,2002," The price of impending death: evidence from compensation awarded to victims contaminated by AIDS in France"," 12(1): 53-82",{"$f":"LEFT(K129,FIND(\"(\",K129,1)-1)","v":" 12"},null,{"$f":"MID(K129,2,2)","v":"12"},{"$f":"MID(K129,5,1)","v":"1"},{"$f":"MID(K129,8,7)","v":" 53-82"},"Y",null,null,"Y"]
["Harrant","Valerie","Vaillant","Nicolas ",null,null,null,null,2006," Compensation and wrongful life: A positive economic perspective"," 13(2): 1-18",{"$f":"LEFT(K130,FIND(\"(\",K130,1)-1)","v":" 13"},null,{"$f":"MID(K130,2,2)","v":"13"},{"$f":"MID(K130,5,1)","v":"2"},{"$f":"MID(K130,8,7)","v":" 1-18"},null,null,null,null,null,null,null,null,null,null,null,null,null,null,null,"Y"]
["Henderson","James W","Seward","Allen J",null,null,null,null,1998," Risk aversion and overcompensation from the risk-free discount rate"," 8(2): 25-32",{"$f":"LEFT(K131,FIND(\"(\",K131,1)-1)","v":" 8"},null,{"$f":"MID(K131,2,1)","v":"8"},{"$f":"MID(K131,4,1)","v":"2"},{"$f":"MID(K131,8,8)","v":"25-32"},null,null,null,null,null,null,null,null,null,null,null,null,"Y"]
["Her","Monica","Jennings","William ","Kinderman","Albert ",null,null,2001," Potential bias in the use of life, participation, and employment approach"," 11(2): 19- 30",{"$f":"LEFT(K132,FIND(\"(\",K132,1)-1)","v":" 11"},null,{"$f":"MID(K132,2,2)","v":"11"},{"$f":"MID(K132,5,1)","v":"2"},{"$f":"MID(K132,8,7)","v":" 19- 30"},null,null,null,null,null,null,null,null,null,null,null,null,null,null,"Y"]
["Hoyt","Richard C",null,"",null,null,null,null,1991," Estimating loss of business goodwill"," 1(3): 33-39",{"$f":"LEFT(K133,FIND(\"(\",K133,1)-1)","v":" 1"},null,{"$f":"MID(K133,2,1)","v":"1"},{"$f":"MID(K133,4,1)","v":"3"},{"$f":"MID(K133,8,8)","v":"33-39"},"Y",null,null,null,"Y"]
["Hoyt","Richard C",null,"",null,null,null,null,1991," The measurement of value"," 1(3): 107-108",{"$f":"LEFT(K134,FIND(\"(\",K134,1)-1)","v":" 1"},null,{"$f":"MID(K134,2,1)","v":"1"},{"$f":"MID(K134,4,1)","v":"3"},{"$f":"MID(K134,8,8)","v":"107-108"},"Y",null,null,null,null,null,null,null,"Y"]
["Hoyt","Richard C",null,"",null,null,null,null,1991," The measurement of value"," 1(2): 87-93",{"$f":"LEFT(K135,FIND(\"(\",K135,1)-1)","v":" 1"},null,{"$f":"MID(K135,2,1)","v":"1"},{"$f":"MID(K135,4,1)","v":"2"},{"$f":"MID(K135,8,8)","v":"87-93"},null,null,null,null,null,null,null,null,null,null,null,null,null,null,null,"Y"]
["Hudgins","Lane B","Ireland","Thomas R.",null,null,null,null,2008,"Pension Benefits as an Evidentiary Collateral Source"," 15(1): 75-81",{"$f":"LEFT(K136,FIND(\"(\",K136,1)-1)","v":" 15"},null,{"$f":"MID(K136,2,2)","v":"15"},{"$f":"MID(K136,5,1)","v":"1"},{"$f":"MID(K136,8,8)","v":" 75-81"},"Y",null,null,null,null,null,null,null,"Y"]
["Ireland","Thomas R",null,"",null,null,null,null,1991," Valuing homemaker production by implied opportunity cost: Using a family human capital methodology"," 1(2): 1-11",{"$f":"LEFT(K137,FIND(\"(\",K137,1)-1)","v":" 1"},null,{"$f":"MID(K137,2,1)","v":"1"},{"$f":"MID(K137,4,1)","v":"2"},{"$f":"MID(K137,8,8)","v":"1-11"},"Y",null,null,null,null,null,null,null,null,"Y"]
["Ireland","Thomas R",null,"",null,null,null,null,1991," Valuing homemaker production by implied opportunity cost: Using a family human capital methodology"," 1(3): 105-106",{"$f":"LEFT(K138,FIND(\"(\",K138,1)-1)","v":" 1"},null,{"$f":"MID(K138,2,1)","v":"1"},{"$f":"MID(K138,4,1)","v":"3"},{"$f":"MID(K138,8,8)","v":"105-106"},"Y",null,null,null,null,null,null,null,null,"Y"]
["Ireland","Thomas R","Rose","David C",null,null,null,null,2001," Comment: Confusion about \"inflation risk\""," 10(3): 53-58",{"$f":"LEFT(K139,FIND(\"(\",K139,1)-1)","v":" 10"},null,{"$f":"MID(K139,1,2)","v":" 1"},{"$f":"MID(K139,5,1)","v":"3"},{"$f":"MID(K139,8,8)","v":" 53-58"},"Y",null,null,null,null,null,"Y"]
["Ireland","Thomas R","Ward","John O",null,null,null,null,2001," The estate of a minor child in a child death case"," 10(3): 23-36",{"$f":"LEFT(K140,FIND(\"(\",K140,1)-1)","v":" 10"},null,{"$f":"MID(K140,1,3)","v":" 10"},{"$f":"MID(K140,5,1)","v":"3"},{"$f":"MID(K140,8,8)","v":" 23-36"},"Y",null,null,null,null,null,"Y"]
["Ireland","Thomas R",null,"",null,null,null,null,2001," Addendum: Historical net discount rates - An update through 2001"," 10(3): 63-76",{"$f":"LEFT(K141,FIND(\"(\",K141,1)-1)","v":" 10"},null,{"$f":"MID(K141,1,3)","v":" 10"},{"$f":"MID(K141,5,1)","v":"3"},{"$f":"MID(K141,8,8)","v":" 63-76"},null,null,null,null,null,null,"Y"]
["Ireland","Thomas R",null,"",null,null,null,null,2000," Historical comparisons between various interest rates and growth rates in the CPI, MCP, average weekly earnings and total compensation in the Employer Cost Index"," 10(1): 25-46",{"$f":"LEFT(K142,FIND(\"(\",K142,1)-1)","v":" 10"},null,{"$f":"MID(K142,1,2)","v":" 1"},{"$f":"MID(K142,5,1)","v":"1"},{"$f":"MID(K142,8,8)","v":" 25-46"},null,null,null,null,null,null,null,null,null,null,null,null,null,null,"Y"]
["Ireland","Thomas R",null,"",null,null,null,null,2001," Origins of the American Academy of Economic and Financial Experts (AAEFE)"," 11(2): 81-88",{"$f":"LEFT(K143,FIND(\"(\",K143,1)-1)","v":" 11"},null,{"$f":"MID(K143,2,2)","v":"11"},{"$f":"MID(K143,5,1)","v":"2"},{"$f":"MID(K143,8,7)","v":" 81-88"},"Y",null,null,null,null,null,null,null,null,"Y"]
["Ireland","Thomas R",null,"",null,null,null,null," 2002-2003","Comment: The Valuations of the Loss of Future Pension Income"," 12(3): 91-96",{"$f":"LEFT(K144,FIND(\"(\",K144,1)-1)","v":" 12"},null,{"$f":"MID(K144,2,2)","v":"12"},{"$f":"MID(K144,5,1)","v":"3"},{"$f":"MID(K144,8,7)","v":" 91-96"},"Y","Y"]
["Ireland","Thomas R",null,"",null,null,null,null,2003," Accounting for work time differences in personal injury litigation"," 13(1): 65-80",{"$f":"LEFT(K145,FIND(\"(\",K145,1)-1)","v":" 13"},null,{"$f":"MID(K145,2,2)","v":"13"},{"$f":"MID(K145,5,1)","v":"1"},{"$f":"MID(K145,8,7)","v":" 65-80"},"Y",null,null,null,null,null,null,null,null,"Y"]
["Ireland","Thomas R","Riccardi","Anthony ",null,null,null," ",2003," Household services as life care: An alternative view of household services in the legal system"," 13(1): 109-118",{"$f":"LEFT(K146,FIND(\"(\",K146,1)-1)","v":" 13"},null,{"$f":"MID(K146,2,2)","v":"13"},{"$f":"MID(K146,5,1)","v":"1"},{"$f":"MID(K146,8,7)","v":" 109-11"},null,null,null,null,null,null,null,null,null,null,null,null,"Y"]
["Ireland","Thomas R",null,"",null,null,null,null,1992," The role of a defense economist in personal injury/ wrongful death litigation"," 2(2): 19-30",{"$f":"LEFT(K147,FIND(\"(\",K147,1)-1)","v":" 2"},null,{"$f":"MID(K147,2,1)","v":"2"},{"$f":"MID(K147,4,1)","v":"2"},{"$f":"MID(K147,8,8)","v":"19-30"},"Y",null,null,null,null,null,null,null,"Y"]
["Ireland","Thomas R","Johnson","Walter D","Rodgers","James D",null,null,1992," Why hedonic measures are irrelevant to wrongful death litigation. "," 2(1): 49-54",{"$f":"LEFT(K148,FIND(\"(\",K148,1)-1)","v":" 2"},null,{"$f":"MID(K148,2,1)","v":"2"},{"$f":"MID(K148,4,1)","v":"1"},{"$f":"MID(K148,8,8)","v":"49-54"},null,null,null,null,null,null,null,null,null,null,null,null,"Y"]
["Ireland","Thomas R",null,"",null,null,null,null,1993," A corrective note on the role of a defense economist in personal injury / wrongful death litigation"," 3(2): 95-96",{"$f":"LEFT(K149,FIND(\"(\",K149,1)-1)","v":" 3"},null,{"$f":"MID(K149,2,1)","v":"3"},{"$f":"MID(K149,4,1)","v":"2"},{"$f":"MID(K149,8,8)","v":"95-96"},"Y",null,null,null,null,"Y"]
["Ireland","Thomas R","Rodgers","James D",null,null,null,null,1993," Hedonic damages in wrongful  death/survival actions: Equitable compensation or optimal life protection"," 3(3): 43-56",{"$f":"LEFT(K150,FIND(\"(\",K150,1)-1)","v":" 3"},null,{"$f":"MID(K150,2,1)","v":"3"},{"$f":"MID(K150,4,1)","v":"3"},{"$f":"MID(K150,8,8)","v":"43-56"},"Y",null,null,null,null,null,null,null,null,"Y"]
["Ireland","Thomas R","Winkler","Anne E",null,null,null,null,1994," Projecting the lost future economic contribution of a female child: Refining income data to reflect true losses"," 4(2): 19-37",{"$f":"LEFT(K151,FIND(\"(\",K151,1)-1)","v":" 4"},null,{"$f":"MID(K151,2,1)","v":"4"},{"$f":"MID(K151,4,1)","v":"2"},{"$f":"MID(K151,8,8)","v":"19-37"},"Y",null,null,null,null,null,null,"Y"]
["Ireland","Thomas R",null,"",null,null,null,null,1995," The application of hedonic models to personal Injury litigation: Comment"," 5(1): 81-85",{"$f":"LEFT(K152,FIND(\"(\",K152,1)-1)","v":" 5"},null,{"$f":"MID(K152,2,1)","v":"5"},{"$f":"MID(K152,4,1)","v":"1"},{"$f":"MID(K152,8,8)","v":"81-85"},"Y","Y"]
["Ireland","Thomas R","Ward","John O",null,null,null,null,1995," The Investment Approach to Parental Loss in the Death of a Child: A Guide to Understanding Alternative Versions"," 5(3): 43-58",{"$f":"LEFT(K153,FIND(\"(\",K153,1)-1)","v":" 5"},null,{"$f":"MID(K153,2,1)","v":"5"},{"$f":"MID(K153,4,1)","v":"3"},{"$f":"MID(K153,8,8)","v":"43-58"},null,null,null,null,null,null,null,null,null,null,null,null,null,null,"Y"]
["Ireland","Thomas R",null,"",null,null,null,null,1997," Book Review: \"Tort reform by contract\": By Paul H Rubin, 1993, Washington D.C. The AEI Press, 1993"," 7(1): 96- 99",{"$f":"LEFT(K154,FIND(\"(\",K154,1)-1)","v":" 7"},null,{"$f":"MID(K154,2,1)","v":"7"},{"$f":"MID(K154,4,1)","v":"1"},{"$f":"MID(K154,8,8)","v":"96- 99"},"Y",null,null,"Y"]
["Ireland","Thomas R",null,"",null,null,null,null," 1997-1998"," The Pfeifer decision  risk and damage awards: An extended response to Albrecht and Wood"," 7(3): 23-34",{"$f":"LEFT(K155,FIND(\"(\",K155,1)-1)","v":" 7"},null,{"$f":"MID(K155,2,1)","v":"7"},{"$f":"MID(K155,4,1)","v":"3"},{"$f":"MID(K155,8,8)","v":"23-34"},null,null,null,null,null,null,null,null,null,null,null,null,null,null,null,"Y"]
["Ireland","Thomas R",null,"",null,null,null,null," 1997-1998"," Back calculating nominal wage rates from nominal wage rates: A useful exercise in forensic economic analysis"," 7(3): 55-74",{"$f":"LEFT(K156,FIND(\"(\",K156,1)-1)","v":" 7"},null,{"$f":"MID(K156,2,1)","v":"7"},{"$f":"MID(K156,4,1)","v":"3"},{"$f":"MID(K156,8,8)","v":"55-74"},null,null,null,null,null,null,null,null,null,null,null,null,null,null,null,"Y"]
["Ireland","Thomas R",null,"",null,null,null,null,1997," The interface between law and economics and forensic economics"," 7(1): 60-71",{"$f":"LEFT(K157,FIND(\"(\",K157,1)-1)","v":" 7"},null,{"$f":"MID(K157,2,1)","v":"7"},{"$f":"MID(K157,4,1)","v":"1"},{"$f":"MID(K157,8,8)","v":"60-71"},null,null,null,null,null,null,null,null,null,null,null,null,null,null,null,"Y"]
["Ireland","Thomas R",null,"",null,null,null,null,1997," Compensable nonmarket services in wrongful death litigation: Legal definitions and measurement standards"," 7(2): 15-34",{"$f":"LEFT(K158,FIND(\"(\",K158,1)-1)","v":" 7"},null,{"$f":"MID(K158,2,1)","v":"7"},{"$f":"MID(K158,4,1)","v":"2"},{"$f":"MID(K158,8,8)","v":"15-34"}]
["Ireland","Thomas R",null,"",null,null,null,null," 1999-2000"," Book Review: Reference manual on scientific evidence, 2nd Edition, Washington D.C.: Federal Judicial Center, 2000"," 9(3): 109-114",{"$f":"LEFT(K159,FIND(\"(\",K159,1)-1)","v":" 9"},null,{"$f":"MID(K159,2,1)","v":"9"},{"$f":"MID(K159,4,1)","v":"3"},{"$f":"MID(K159,8,8)","v":"109-114"},"Y",null,null,"Y"]
["Ireland","Thomas R",null,"",null,null,null,null," 1999-2000"," Comment: Is the rate on TIPS bonds an adequate measure of the real interest rate?: Correction and elaboration"," 9(3): 105-108",{"$f":"LEFT(K160,FIND(\"(\",K160,1)-1)","v":" 9"},null,{"$f":"MID(K160,2,1)","v":"9"},{"$f":"MID(K160,4,1)","v":"3"},{"$f":"MID(K160,8,8)","v":"105-108"},"Y",null,null,null,null,null,"Y"]
["Ireland","Thomas R",null,"",null,null,null,null,1999," Book Review: Determining economic damages, 1999 Edition"," 9(1): 87-92",{"$f":"LEFT(K161,FIND(\"(\",K161,1)-1)","v":" 9"},null,{"$f":"MID(K161,2,1)","v":"9"},{"$f":"MID(K161,4,1)","v":"1"},{"$f":"MID(K161,8,8)","v":"87-92"},"Y",null,null,null,null,"Y"]
["Ireland","Thomas R",null,"",null,null,null,null,1999," Total offsets in forensic economics: Legal requirements, data comparisons, and jury comprehension"," 9(2): 9- 24",{"$f":"LEFT(K162,FIND(\"(\",K162,1)-1)","v":" 9"},null,{"$f":"MID(K162,2,1)","v":"9"},{"$f":"MID(K162,4,1)","v":"2"},{"$f":"MID(K162,8,8)","v":"9- 24"},"Y",null,null,null,null,null,"Y"]
["Ireland","Thomas R",null,"",null,null,null,null," 1999-2000"," Comment: Nonmarket services: An offset in certain cases"," 9(3): 97-104",{"$f":"LEFT(K163,FIND(\"(\",K163,1)-1)","v":" 9"},null,{"$f":"MID(K163,2,1)","v":"9"},{"$f":"MID(K163,4,1)","v":"3"},{"$f":"MID(K163,8,8)","v":"97-104"},null,null,null,null,null,null,null,null,null,"Y"]
["Ireland","Thomas R",null,"",null,null,null,null,1999," Comment: Self-Consumption and children's losses in the death of a single parent"," 9(2): 69-74",{"$f":"LEFT(K164,FIND(\"(\",K164,1)-1)","v":" 9"},null,{"$f":"MID(K164,2,1)","v":"9"},{"$f":"MID(K164,4,1)","v":"2"},{"$f":"MID(K164,8,8)","v":"69-74"},null,null,null,null,"Y"]
["Ireland","Thomas R",null,"",null,null,null,null,1999," Improving the objectivity of economic expert testimony for personal injury/wrongful death litigation"," 9(2): 33-52",{"$f":"LEFT(K165,FIND(\"(\",K165,1)-1)","v":" 9"},null,{"$f":"MID(K165,2,1)","v":"9"},{"$f":"MID(K165,4,1)","v":"2"},{"$f":"MID(K165,8,8)","v":"33-52"},null,null,null,null,null,null,null,null,null,null,null,null,null,null,null,"Y"]
["Ireland","Thomas R",null,null,null,null,null,null,2008,"The Concept of Reasonable Value in Recovery of Medical Expenses in Personal Injury Torts","14 (3):87-99",{"$f":"LEFT(K166,FIND(\"(\",K166,1)-1)","v":"14 "},null,{"$f":"MID(K166,2,1)","v":"4"},{"$f":"MID(K166,4,1)","v":"("},{"$f":"MID(K166,8,8)","v":"87-99"},"Y",null,null,null,"Y"]
["Isley","Phyllis","Rosenman","Robert",null,null,null,null,1997," An economic analysis of the value of lost health"," 7(1): 26-47",{"$f":"LEFT(K167,FIND(\"(\",K167,1)-1)","v":" 7"},null,{"$f":"MID(K167,2,1)","v":"7"},{"$f":"MID(K167,4,1)","v":"1"},{"$f":"MID(K167,8,8)","v":"26-47"},null,null,null,null,null,null,null,null,null,null,null,null,null,null,null,"Y"]
["Jackson","Daniel L","Cable","Sandra ",null,null,null,null,2002," Forecasting data in litigation utilizing correlation  ARIMA and curve estimation"," 12(1): 39-51",{"$f":"LEFT(K168,FIND(\"(\",K168,1)-1)","v":" 12"},null,{"$f":"MID(K168,2,2)","v":"12"},{"$f":"MID(K168,5,1)","v":"1"},{"$f":"MID(K168,8,7)","v":" 39-51"},"Y","Y"]
["Jennings","Penelope R","Jennings","William P",null,null,null,null,2002," Problems with the use of periodic payments in actions against health care providers"," 12(1): 23-37",{"$f":"LEFT(K169,FIND(\"(\",K169,1)-1)","v":" 12"},null,{"$f":"MID(K169,2,2)","v":"12"},{"$f":"MID(K169,5,1)","v":"1"},{"$f":"MID(K169,8,7)","v":" 23-37"},null,null,null,null,null,null,null,null,null,null,null,null,null,null,null,"Y"]
["Jennings","William P",null,"",null,null,null,null,1991," Some methodological problems with the justice  department merger guidelines"," 2(1): 85-90",{"$f":"LEFT(K170,FIND(\"(\",K170,1)-1)","v":" 2"},null,{"$f":"MID(K170,2,1)","v":"2"},{"$f":"MID(K170,4,1)","v":"1"},{"$f":"MID(K170,8,8)","v":"85-90"},null,null,null,null,null,null,null,null,null,null,null,null,null,null,null,"Y"]
["Jennings","William","Mercurio-Jennings","Penelope ",null,null,null,null,1998," A critique of the joint probability of life, participation, and employment approach"," 8(1): 61-70",{"$f":"LEFT(K171,FIND(\"(\",K171,1)-1)","v":" 8"},null,{"$f":"MID(K171,2,1)","v":"8"},{"$f":"MID(K171,4,1)","v":"1"},{"$f":"MID(K171,8,8)","v":"61-70"},null,null,null,null,null,null,null,null,null,null,null,null,null,null,null,"Y"]
["Johnson","Walter D","Gelles","Gregory M",null,null,null,null,2000," An examination of historical net discount rate relationships, relative to medical care costs"," 10(1): 1-24",{"$f":"LEFT(K172,FIND(\"(\",K172,1)-1)","v":" 10"},null,{"$f":"MID(K172,1,2)","v":" 1"},{"$f":"MID(K172,5,1)","v":"1"},{"$f":"MID(K172,8,8)","v":" 1-24"},"Y",null,null,null,null,null,"Y"]
["Johnson","Walter D","Sattler","Edward L",null,null,null,null,1992," The importance of the selection process in maintaining expert credibility: A guideline for choosing the economist"," 2(3): 3-12",{"$f":"LEFT(K173,FIND(\"(\",K173,1)-1)","v":" 2"},null,{"$f":"MID(K173,2,1)","v":"2"},{"$f":"MID(K173,4,1)","v":"3"},{"$f":"MID(K173,8,8)","v":"3-12"},null,null,null,null,null,null,null,null,null,null,null,null,"Y"]
["Johnson","L E","Ley","Robert D","Benshoof","Paul T",null,null,1993," Estimating economic loss for a facially disfigured minor: A case study. "," 3(2): 1- 10",{"$f":"LEFT(K174,FIND(\"(\",K174,1)-1)","v":" 3"},null,{"$f":"MID(K174,2,1)","v":"3"},{"$f":"MID(K174,4,1)","v":"2"},{"$f":"MID(K174,8,8)","v":"1- 10"},null,null,null,null,null,null,null,null,null,null,null,null,null,"Y"]
["Johnson","L E","Ley"," Robert D",null,null,null,null,1998," Economic loss of individuals with the potential for the total loss of vision: A note"," 8(2): 97-101",{"$f":"LEFT(K175,FIND(\"(\",K175,1)-1)","v":" 8"},null,{"$f":"MID(K175,2,1)","v":"8"},{"$f":"MID(K175,4,1)","v":"2"},{"$f":"MID(K175,8,8)","v":"97-101"},"Y",null,null,null,null,null,"Y"]
["Johnson","L E",null,"",null,null,null,null,1998," Estimating economic loss for a minor with eye loss: A case study"," 8(1): 61-70",{"$f":"LEFT(K176,FIND(\"(\",K176,1)-1)","v":" 8"},null,{"$f":"MID(K176,2,1)","v":"8"},{"$f":"MID(K176,4,1)","v":"1"},{"$f":"MID(K176,8,8)","v":"61-70"},null,null,null,null,null,null,null,null,null,null,null,null,null,null,null,"Y"]
["Jones","David D.",null,null,null,null,null,null,2008,"Calculating the Value of a Life Care Plan With Contingent Costs"," 15(1): 83-85",{"$f":"LEFT(K177,FIND(\"(\",K177,1)-1)","v":" 15"},null,{"$f":"MID(K177,2,2)","v":"15"},{"$f":"MID(K177,5,1)","v":"1"},{"$f":"MID(K177,8,8)","v":" 83-85"},"Y",null,null,null,"Y"]
["Kamerschen","David R",null,"",null,null,null,null,1994," Testing for antitrust market definition under the federal government guidelines"," 4(1): 1-10",{"$f":"LEFT(K178,FIND(\"(\",K178,1)-1)","v":" 4"},null,{"$f":"MID(K178,2,1)","v":"4"},{"$f":"MID(K178,4,1)","v":"1"},{"$f":"MID(K178,8,8)","v":"1-10"},"Y",null,null,null,null,null,null,null,null,null,"Y"]
["Krueger","Kurt V.","Albrecht","Gary R.",null,null,null,null,2008,"The Present Value of Lost Financial Support Due to Wrongful Death"," 15(1): 35-42",{"$f":"LEFT(K179,FIND(\"(\",K179,1)-1)","v":" 15"},null,{"$f":"MID(K179,2,2)","v":"15"},{"$f":"MID(K179,5,1)","v":"1"},{"$f":"MID(K179,8,8)","v":" 35-42"},null,null,null,null,null,null,null,null,null,null,null,null,null,null,null,"Y"]
["Landsea","William F",null,"",null,null,null,null,1991," Work life? Definitions and impact on methodology"," 1(1): 51-62",{"$f":"LEFT(K180,FIND(\"(\",K180,1)-1)","v":" 1"},null,{"$f":"MID(K180,2,1)","v":"1"},{"$f":"MID(K180,4,1)","v":"1"},{"$f":"MID(K180,8,8)","v":"51-62"},null,null,null,null,null,null,null,null,null,null,null,null,null,"Y"]
["Landsea","William F",null,"",null,null,null,null,1994," Projecting the benefits of earning capacity"," 4(3): 73-83",{"$f":"LEFT(K181,FIND(\"(\",K181,1)-1)","v":" 4"},null,{"$f":"MID(K181,2,1)","v":"4"},{"$f":"MID(K181,4,1)","v":"3"},{"$f":"MID(K181,8,8)","v":"73-83"},"Y",null,null,null,null,null,"Y"]
["Landsea","William F",null,"",null,null,null,null,1999," There is no free lunch: Risky discount rates are still risky"," 9(2): 1-8",{"$f":"LEFT(K182,FIND(\"(\",K182,1)-1)","v":" 9"},null,{"$f":"MID(K182,2,1)","v":"9"},{"$f":"MID(K182,4,1)","v":"2"},{"$f":"MID(K182,8,8)","v":"1-8"},"Y",null,null,null,null,"Y"]
["Larimore","Keith L",null,"",null,null,null,null,1991," Evaluating household services and other nonmarket production"," 1(1): 63-66",{"$f":"LEFT(K183,FIND(\"(\",K183,1)-1)","v":" 1"},null,{"$f":"MID(K183,2,1)","v":"1"},{"$f":"MID(K183,4,1)","v":"1"},{"$f":"MID(K183,8,8)","v":"63-66"},null,null,null,null,null,null,null,null,null,null,null,null,"Y"]
["Launey","David V","Launey","George V",null,null,null,null,1993," Valuation of vested pension  benefits in divorce and wrongful death actions: Using the PBGC tables"," 3(3): 1-10",{"$f":"LEFT(K184,FIND(\"(\",K184,1)-1)","v":" 3"},null,{"$f":"MID(K184,2,1)","v":"3"},{"$f":"MID(K184,4,1)","v":"3"},{"$f":"MID(K184,8,8)","v":"1-10"},"Y",null,null,null,null,null,"Y"]
["Launey","David V","Launey","George V",null,null,null,null,1994," Valuation of vested pension  benefits: A reply and elaboration"," 4(1): 87-90",{"$f":"LEFT(K185,FIND(\"(\",K185,1)-1)","v":" 4"},null,{"$f":"MID(K185,2,1)","v":"4"},{"$f":"MID(K185,4,1)","v":"1"},{"$f":"MID(K185,8,8)","v":"87-90"},"Y",null,null,null,null,null,null,null,"Y"]
["Lawlis","Frank","Male","Robert",null,null,null,null,1994," Methodological issues: Interest rate and wage growth forecasting"," 4(3): 55-61",{"$f":"LEFT(K186,FIND(\"(\",K186,1)-1)","v":" 4"},null,{"$f":"MID(K186,2,1)","v":"4"},{"$f":"MID(K186,4,1)","v":"3"},{"$f":"MID(K186,8,8)","v":"55-61"},"Y",null,null,null,null,"Y"]
["Lester","Rick A","McCoy","Dan W",null,null,null,null,1992," The role of the forensic economist and financial expert as affected by the civil rights act of 1991"," 2(2): 39-48",{"$f":"LEFT(K187,FIND(\"(\",K187,1)-1)","v":" 2"},null,{"$f":"MID(K187,2,1)","v":"2"},{"$f":"MID(K187,4,1)","v":"2"},{"$f":"MID(K187,8,8)","v":"39-48"},"Y",null,null,null,null,null,"Y"]
["Lewis","W Cris","Caliendo","Frank N","Bowles","Tyler J",null,null,2001," Measuring public safety retirement plan wealth: Implications for assessing economic loss"," 11(2): 61-80",{"$f":"LEFT(K188,FIND(\"(\",K188,1)-1)","v":" 11"},null,{"$f":"MID(K188,2,2)","v":"11"},{"$f":"MID(K188,5,1)","v":"2"},{"$f":"MID(K188,8,7)","v":" 61-80"},null,null,null,null,null,null,null,null,null,null,null,null,"Y"]
["Lewis","CrisW",null,"",null,null,null,null,1992," The rationale and quantitative evidence for the personal consumption offset in wrongful death actions"," 2(2): 1-18",{"$f":"LEFT(K189,FIND(\"(\",K189,1)-1)","v":" 2"},null,{"$f":"MID(K189,2,1)","v":"2"},{"$f":"MID(K189,4,1)","v":"2"},{"$f":"MID(K189,8,8)","v":"1-18"},"Y",null,null,null,"Y"]
["Lewis","W Cris",null,"",null,null,null,null,1995," Measuring the effect of preexisting health conditions on expected economic loss"," 5(2): 33-42",{"$f":"LEFT(K190,FIND(\"(\",K190,1)-1)","v":" 5"},null,{"$f":"MID(K190,2,1)","v":"5"},{"$f":"MID(K190,4,1)","v":"2"},{"$f":"MID(K190,8,8)","v":"33-42"},"Y","Y"]
["Lewis","W Cris","Bowles","Tyler J",null,null,null,null,"  1996-1997"," The effect of capital market imperfections and intertemporal choice on the valuation of retirement fund contributions"," 6(3): 55-62",{"$f":"LEFT(K191,FIND(\"(\",K191,1)-1)","v":" 6"},null,{"$f":"MID(K191,2,1)","v":"6"},{"$f":"MID(K191,4,1)","v":"3"},{"$f":"MID(K191,8,8)","v":"55-62"},"Y",null,null,null,null,null,null,null,"Y"]
["Lewis","W Cris","Bowles","Tyler J",null,null,null,null,"  1996-1997"," The economics of the litigation process and the division of the settlement surplus: A gametheoretic approach"," 6(3): 1-10",{"$f":"LEFT(K192,FIND(\"(\",K192,1)-1)","v":" 6"},null,{"$f":"MID(K192,2,1)","v":"6"},{"$f":"MID(K192,4,1)","v":"3"},{"$f":"MID(K192,8,8)","v":"1-10"},"Y",null,null,"Y"]
["Lewis","W Cris","Bowles","Tyler J",null,null,null,null,1996," Alternative approaches to tax adjustments in appraising economic loss"," 6(1): 27-38",{"$f":"LEFT(K193,FIND(\"(\",K193,1)-1)","v":" 6"},null,{"$f":"MID(K193,2,1)","v":"6"},{"$f":"MID(K193,4,1)","v":"1"},{"$f":"MID(K193,8,8)","v":"27-38"},"Y",null,"Y"]
["Lewis","Eric E","Lippitt","Jeffrey W",null,null,null,null,1999," Valuing intellectual assets"," 9(1): 20-30",{"$f":"LEFT(K194,FIND(\"(\",K194,1)-1)","v":" 9"},null,{"$f":"MID(K194,2,1)","v":"9"},{"$f":"MID(K194,4,1)","v":"1"},{"$f":"MID(K194,8,8)","v":"20-30"},"Y",null,null,null,"Y"]
["Lino","Mark",null,"",null,null,null,null,1991," Expenditures on children by families: U.S. Department of Agriculture estimates and alternative estimators "," 1(2): 31-48",{"$f":"LEFT(K195,FIND(\"(\",K195,1)-1)","v":" 1"},null,{"$f":"MID(K195,2,1)","v":"1"},{"$f":"MID(K195,4,1)","v":"2"},{"$f":"MID(K195,8,8)","v":"31-48"},null,null,null,null,null,null,null,null,null,null,null,null,null,null,null,"Y"]
["Liuzzo","Anthony L",null,"",null,null,null,null,1991," Hedonic damages: Concepts, measurements, and problems"," 1(2): 58-65",{"$f":"LEFT(K196,FIND(\"(\",K196,1)-1)","v":" 1"},null,{"$f":"MID(K196,2,1)","v":"1"},{"$f":"MID(K196,4,1)","v":"2"},{"$f":"MID(K196,8,8)","v":"58-65"},null,null,null,null,null,null,null,null,null,"Y"]
["Liuzzo","Anthony L",null,"",null,null,null,null,1993," Punitive damages: Policies and problems"," 3(1): 53-64",{"$f":"LEFT(K197,FIND(\"(\",K197,1)-1)","v":" 3"},null,{"$f":"MID(K197,2,1)","v":"3"},{"$f":"MID(K197,4,1)","v":"1"},{"$f":"MID(K197,8,8)","v":"53-64"},"Y",null,null,null,null,null,null,null,"Y"]
["Lynch","L A","Stauffer","R F",null,null,null,null,1993," Single equation models for valuing economic loss"," 3(2): 53-60",{"$f":"LEFT(K198,FIND(\"(\",K198,1)-1)","v":" 3"},null,{"$f":"MID(K198,2,1)","v":"3"},{"$f":"MID(K198,4,1)","v":"2"},{"$f":"MID(K198,8,8)","v":"53-60"},"Y",null,null,null,null,null,null,null,null,null,"Y"]
["Male","Robert A","Lawliss","Frank G",null,null,null,null,1996," Rejoinder to Johnson and Gelles"," 6(1): 75-79",{"$f":"LEFT(K199,FIND(\"(\",K199,1)-1)","v":" 6"},null,{"$f":"MID(K199,2,1)","v":"6"},{"$f":"MID(K199,4,1)","v":"1"},{"$f":"MID(K199,8,8)","v":"75-79"},null,null,null,null,null,null,null,null,null,null,null,null,"Y"]
["Male","Robert A",null,"",null,null,null,null,1996," Book Review: \"Valuing children in litigation: Family and individual loss assessment\": By Thomas R Ireland and John O Ward 1995 Tucson: Lawyers & Judges Publishing Co., Inc, 1995"," 6(2): 95-97",{"$f":"LEFT(K200,FIND(\"(\",K200,1)-1)","v":" 6"},null,{"$f":"MID(K200,2,1)","v":"6"},{"$f":"MID(K200,4,1)","v":"2"},{"$f":"MID(K200,8,8)","v":"95-97"},null,null,null,null,null,null,null,"Y"]
["Markowski","Edward P","Cross","Edward M",null,null,null,null,1991," Determination of taxadjusted lost income awards: Reply"," 1(3): 103-104",{"$f":"LEFT(K201,FIND(\"(\",K201,1)-1)","v":" 1"},null,{"$f":"MID(K201,2,1)","v":"1"},{"$f":"MID(K201,4,1)","v":"3"},{"$f":"MID(K201,8,8)","v":"103-104"},"Y",null,null,null,null,null,null,null,null,null,"Y"]
["Markowski","Edward P","Cross","Edward M",null,null,null,null,1991," Determination of tax adjusted lost income awards"," 1(1): 11-18",{"$f":"LEFT(K202,FIND(\"(\",K202,1)-1)","v":" 1"},null,{"$f":"MID(K202,2,1)","v":"1"},{"$f":"MID(K202,4,1)","v":"1"},{"$f":"MID(K202,8,8)","v":"11-18"},null,null,null,null,null,null,null,null,null,null,null,null,null,null,null,"Y"]
["Marks","Denton",null,"",null,null,null,null,1995," Cash constraints, the rational choice of net reductions in household resources, and the estimation of damages."," 5(2): 11-22",{"$f":"LEFT(K203,FIND(\"(\",K203,1)-1)","v":" 5"},null,{"$f":"MID(K203,2,1)","v":"5"},{"$f":"MID(K203,4,1)","v":"2"},{"$f":"MID(K203,8,8)","v":"11-22"},"Y",null,null,"Y"]
["Marlin","Matthew",null,"",null,null,null,null,2007," The Problem of Discounting with an After-Tax Rate of Return in Cases of Personal Injury or Wrongful Death"," 14(1): 33-48",{"$f":"LEFT(K204,FIND(\"(\",K204,1)-1)","v":" 14"},null,{"$f":"MID(K204,2,2)","v":"14"},{"$f":"MID(K204,5,1)","v":"1"},{"$f":"MID(K204,8,8)","v":" 33-48"},"Y",null,null,null,null,null,null,null,null,"Y"]
["Marshall","Jennings B","Lee","John T",null,null,null,null,1991," Achieving optimality in wrongful death awards"," 1(2): 31-37",{"$f":"LEFT(K205,FIND(\"(\",K205,1)-1)","v":" 1"},null,{"$f":"MID(K205,2,2)","v":"1("},{"$f":"MID(K205,5,1)","v":")"},{"$f":"MID(K205,8,7)","v":"31-37"},"Y",null,null,"Y"]
["Mathis","Gilbert L",null,"",null,null,null,null,1991," Alternative methods of appraising the destruction of earning power"," 1(3): 90-94",{"$f":"LEFT(K206,FIND(\"(\",K206,1)-1)","v":" 1"},null,{"$f":"MID(K206,2,2)","v":"1("},{"$f":"MID(K206,5,1)","v":")"},{"$f":"MID(K206,8,8)","v":"90-94"},"Y",null,null,null,null,null,"Y"]
["Mathis","Gilbert L","Lawson","Michael C",null,null,null,null," 1998-1999"," A note on estimating lost earnings from partial permanent injury: Three approaches for the trier of fact"," 8(3): 81-91",{"$f":"LEFT(K207,FIND(\"(\",K207,1)-1)","v":" 8"},null,{"$f":"MID(K207,2,1)","v":"8"},{"$f":"MID(K207,4,1)","v":"3"},{"$f":"MID(K207,8,8)","v":"81-91"},"Y"]
["McCann","Craig J","Hsu","avid",null,null,null,null,"  1998-1999"," Accelerated trading models used in securities class action lawsuits"," 8(3): 1-48",{"$f":"LEFT(K208,FIND(\"(\",K208,1)-1)","v":" 8"},null,{"$f":"MID(K208,2,1)","v":"8"},{"$f":"MID(K208,4,1)","v":"3"},{"$f":"MID(K208,8,8)","v":"1-48"},"Y",null,null,"Y"]
["McCann","Craig",null,"",null,null,null,null,1999," Comment: Churning"," 9(1): 49-68",{"$f":"LEFT(K209,FIND(\"(\",K209,1)-1)","v":" 9"},null,{"$f":"MID(K209,2,1)","v":"9"},{"$f":"MID(K209,4,1)","v":"1"},{"$f":"MID(K209,8,8)","v":"49-68"},null,null,null,null,null,null,null,null,null,null,"Y"]
["McCollister","George M","Pflaum","Christopher C",null,null,null,null,2007," A Note on the Steady State Assumption and Expectancy Bias"," 14(2): 85-96",{"$f":"LEFT(K210,FIND(\"(\",K210,1)-1)","v":" 14"},null,{"$f":"MID(K210,2,2)","v":"14"},{"$f":"MID(K210,5,1)","v":"2"},{"$f":"MID(K210,8,8)","v":" 85-96"},"Y",null,null,null,null,null,"Y"]
["Meyer","James E","Fitzgerald","Patrick","Moini","Mostafa",null,null,1994," Loss of business profits, risk, and the appropriate discount rate"," 4(3): 27-42",{"$f":"LEFT(K211,FIND(\"(\",K211,1)-1)","v":" 4"},null,{"$f":"MID(K211,2,1)","v":"4"},{"$f":"MID(K211,4,1)","v":"3"},{"$f":"MID(K211,8,8)","v":"27-42"},"Y",null,null,"Y"]
["Mitenko","Graham","Okleshen","Henry",null,null,null,null,1998," Valuing a non-publicly-traded business: A review and update"," 8(2): 33-48",{"$f":"LEFT(K212,FIND(\"(\",K212,1)-1)","v":" 8"},null,{"$f":"MID(K212,2,1)","v":"8"},{"$f":"MID(K212,4,1)","v":"2"},{"$f":"MID(K212,8,8)","v":"33-48"},"Y",null,null,null,null,null,null,"Y"]
["Moore","Mary Virginia","Johnson","Gary G","Beard","Deborah F",null,null,1999," Liability in litigation support and courtroom testimony: Is it time to rethink the risks? "," 9(2): 53-68",{"$f":"LEFT(K213,FIND(\"(\",K213,1)-1)","v":" 9"},null,{"$f":"MID(K213,2,1)","v":"9"},{"$f":"MID(K213,4,1)","v":"2"},{"$f":"MID(K213,8,8)","v":"53-68"},"Y",null,null,null,null,null,null,"Y"]
["Morris","Pamela",null,"",null,null,null,null,2006," Club participation: Effects of future household earnings potential"," 13(2): 45-76",{"$f":"LEFT(K214,FIND(\"(\",K214,1)-1)","v":" 13"},null,{"$f":"MID(K214,2,2)","v":"13"},{"$f":"MID(K214,5,1)","v":"2"},{"$f":"MID(K214,8,7)","v":" 45-76"},null,null,null,null,null,null,null,null,null,null,null,null,null,null,null,"Y"]
["Morse","Joel N","Siedenberg","Jeffrey M",null,null,null,null,2000," Transportation expenses in life care plans: An incremental approach"," 10(1): 61 72",{"$f":"LEFT(K215,FIND(\"(\",K215,1)-1)","v":" 10"},null,{"$f":"MID(K215,1,2)","v":" 1"},{"$f":"MID(K215,5,1)","v":"1"},{"$f":"MID(K215,8,8)","v":" 61 72"},null,null,null,null,null,null,null,null,null,null,null,null,null,null,null,"Y"]
["Nelson","David M","Patton","Robert T",null,null,null,null,1993," Measuring earnings growth in the U S"," 3(3): 11-22",{"$f":"LEFT(K216,FIND(\"(\",K216,1)-1)","v":" 3"},null,{"$f":"MID(K216,2,1)","v":"3"},{"$f":"MID(K216,4,1)","v":"3"},{"$f":"MID(K216,8,8)","v":"11-22"},"Y",null,null,"Y"]
["Nieberding","James Fe","Cantor","Robin A",null,null,null,null,2007," Price Dispersion and Class Certification in Antitrust Cases: An Economic Analysis"," 14(2): 61- 84",{"$f":"LEFT(K217,FIND(\"(\",K217,1)-1)","v":" 14"},null,{"$f":"MID(K217,2,2)","v":"14"},{"$f":"MID(K217,5,1)","v":"2"},{"$f":"MID(K217,8,8)","v":" 61- 84"},"Y",null,null,null,null,null,null,null,null,"Y"]
["O'Hara","Michel J","Mitenko","Graham ",null,null,null,null,2000," Scope of discovery of an expert's work product"," 10(2): 37-54",{"$f":"LEFT(K218,FIND(\"(\",K218,1)-1)","v":" 10"},null,{"$f":"MID(K218,1,3)","v":" 10"},{"$f":"MID(K218,5,1)","v":"2"},{"$f":"MID(K218,8,8)","v":" 37-54"},null,null,null,null,null,null,null,null,null,null,null,"Y"]
["O'Haver","Robert",null,"",null,null,null,null,1994," The economics of breach of contract litigation: A case study"," 4(2): 89-95",{"$f":"LEFT(K219,FIND(\"(\",K219,1)-1)","v":" 4"},null,{"$f":"MID(K219,2,1)","v":"4"},{"$f":"MID(K219,4,1)","v":"2"},{"$f":"MID(K219,8,8)","v":"89-95"},null,null,null,null,null,null,null,null,null,null,null,null,null,null,null,"Y"]
["Olson","Edwin G",null,"",null,null,null,null," 1996-1997"," Economic losses from terminated employment"," 6(3): 11-38",{"$f":"LEFT(K220,FIND(\"(\",K220,1)-1)","v":" 6"},null,{"$f":"MID(K220,2,1)","v":"6"},{"$f":"MID(K220,4,1)","v":"3"},{"$f":"MID(K220,8,8)","v":"11-38"},"Y",null,null,"Y"]
["Olson","Edwin G",null,"",null,null,null,null,1998," Response: Economic losses from terminated employment"," 8(1): 95-99",{"$f":"LEFT(K221,FIND(\"(\",K221,1)-1)","v":" 8"},null,{"$f":"MID(K221,2,1)","v":"8"},{"$f":"MID(K221,4,1)","v":"1"},{"$f":"MID(K221,8,8)","v":"95-99"},"Y",null,null,null,null,null,null,null,null,null,"Y"]
["Osteryoung","Jerome S","Brown","Kirk","Henniger","Mark",null,null,1992," Shareholder supplied funds: Debt or equity. "," 2(1): 1-16",{"$f":"LEFT(K222,FIND(\"(\",K222,1)-1)","v":" 2"},null,{"$f":"MID(K222,2,1)","v":"2"},{"$f":"MID(K222,4,1)","v":"1"},{"$f":"MID(K222,8,8)","v":"1-16"},"Y",null,"Y"]
["Paine","James E","Ewing","Bradley T","Piette","Michael J",null,null,2001," Total offset method: Is it appropriate? Evidence from ECI data"," 11(2): 1-18",{"$f":"LEFT(K223,FIND(\"(\",K223,1)-1)","v":" 11"},null,{"$f":"MID(K223,1,3)","v":" 11"},{"$f":"MID(K223,5,1)","v":"2"},{"$f":"MID(K223,8,8)","v":" 1-18"},"Y",null,null,null,null,null,null,null,"Y"]
["Paul","Harvey",null,"",null,null,null,null,1991," Household services and the division of marital property in domestic litigation"," 1(1): 35-42",{"$f":"LEFT(K224,FIND(\"(\",K224,1)-1)","v":" 1"},null,{"$f":"MID(K224,2,2)","v":"1("},{"$f":"MID(K224,5,1)","v":")"},{"$f":"MID(K224,8,7)","v":"35-42"},"Y","Y"]
["Paul","Harvey",null,"",null,null,null,null,1997," Critical review: The new Cornell report on the value of household output"," 7(2): 35-42",{"$f":"LEFT(K225,FIND(\"(\",K225,1)-1)","v":" 7"},null,{"$f":"MID(K225,2,1)","v":"7"},{"$f":"MID(K225,4,1)","v":"2"},{"$f":"MID(K225,8,8)","v":"35-42"},null,null,null,null,null,null,null,null,null,null,null,null,null,null,null,"Y"]
["Payne","James E","Piette","Michael J",null,null,null,null,2001," Reply: Confusion about \"inflation risk\""," 10(3): 59-62",{"$f":"LEFT(K226,FIND(\"(\",K226,1)-1)","v":" 10"},null,{"$f":"MID(K226,1,3)","v":" 10"},{"$f":"MID(K226,5,1)","v":"3"},{"$f":"MID(K226,8,8)","v":" 59-62"},null,null,null,null,null,null,null,null,null,null,null,null,null,null,null,"Y"]
["Payne","James E","Piette","ichael J",null,null,null,null,2000," Comment: A critique of the joint probability of life participation and employment approach"," 10(2): 81-85",{"$f":"LEFT(K227,FIND(\"(\",K227,1)-1)","v":" 10"},null,{"$f":"MID(K227,1,3)","v":" 10"},{"$f":"MID(K227,5,1)","v":"2"},{"$f":"MID(K227,8,8)","v":" 81-85"},null,null,null,null,null,null,null,null,null,null,null,null,null,null,null,"Y"]
["Payne","James E","Ewing","Bradley T","Piette","Michael J",null,null,1999," Mean reversion in net discount rates"," 9(1): 69-80",{"$f":"LEFT(K228,FIND(\"(\",K228,1)-1)","v":" 9"},null,{"$f":"MID(K228,2,1)","v":"9"},{"$f":"MID(K228,4,1)","v":"1"},{"$f":"MID(K228,8,8)","v":"69-80"},"Y",null,null,null,null,null,null,"Y"]
["Pelaez","Rolando F",null,"",null,null,null,null,1995," Calculating awards for lost earnings: An empirical assessment of Beaulieu."," 5(1): 49-62",{"$f":"LEFT(K229,FIND(\"(\",K229,1)-1)","v":" 5"},null,{"$f":"MID(K229,2,1)","v":"5"},{"$f":"MID(K229,4,1)","v":"1"},{"$f":"MID(K229,8,8)","v":"49-62"},"Y",null,null,null,null,null,null,null,null,"Y"]
["Pelaez","Rolando F",null,"",null,null,null,null,1995," Pennsylvania's offset rule: Fantasy masquerading as economics"," 5(3): 1-16",{"$f":"LEFT(K230,FIND(\"(\",K230,1)-1)","v":" 5"},null,{"$f":"MID(K230,2,1)","v":"5"},{"$f":"MID(K230,4,1)","v":"3"},{"$f":"MID(K230,8,8)","v":"1-16"},null,null,null,null,null,null,null,null,null,null,null,null,null,"Y"]
["Pelaez","Roland F",null,"",null,null,null,null," 1996-1997"," Mean reversion in the net discount rate: The evidence from the manufacturing sector"," 6(3): 77-78",{"$f":"LEFT(K231,FIND(\"(\",K231,1)-1)","v":" 6"},null,{"$f":"MID(K231,2,1)","v":"6"},{"$f":"MID(K231,4,1)","v":"3"},{"$f":"MID(K231,8,8)","v":"77-78"},"Y",null,null,null,null,null,null,null,null,null,"Y"]
["Pelaez","Rolando F",null,"",null,null,null,null,1996," Mean-Reversion in the net discount rate: The evidence from the manufacturing sector"," 6(2): 29-40",{"$f":"LEFT(K232,FIND(\"(\",K232,1)-1)","v":" 6"},null,{"$f":"MID(K232,2,1)","v":"6"},{"$f":"MID(K232,4,1)","v":"2"},{"$f":"MID(K232,8,8)","v":"29-40"},"Y",null,null,null,null,null,"Y"]
["Peterson","R .D.",null,"",null,null,null,null,1991," Economics and antitrust litigation"," 1(2): 74-86",{"$f":"LEFT(K233,FIND(\"(\",K233,1)-1)","v":" 1"},null,{"$f":"MID(K233,2,2)","v":"1("},{"$f":"MID(K233,5,1)","v":")"},{"$f":"MID(K233,8,7)","v":"74-86"},null,null,null,null,null,null,null,null,null,null,null,null,"Y"]
["Phukan","Sanjeev","Johnson","L E",null,null,null,null,1996," Information systems ethics and civil litigation: A new role for the economic expert"," 6(1): 39-51",{"$f":"LEFT(K234,FIND(\"(\",K234,1)-1)","v":" 6"},null,{"$f":"MID(K234,2,1)","v":"6"},{"$f":"MID(K234,4,1)","v":"1"},{"$f":"MID(K234,8,8)","v":"39-51"},null,null,null,null,null,null,null,null,null,null,null,null,null,"Y"]
["Piette","Michael J","Sauer","Douglas G",null,null,null,null,1992," The use of multivariate selection models in fair employment litigation"," 2(3): 13-24",{"$f":"LEFT(K235,FIND(\"(\",K235,1)-1)","v":" 2"},null,{"$f":"MID(K235,2,1)","v":"2"},{"$f":"MID(K235,4,1)","v":"3"},{"$f":"MID(K235,8,8)","v":"13-24"},"Y",null,null,null,"Y"]
["Piette","Michael J","Haworth","Charles T",null,null,null,null,1992," How economists can help in litigation involving personal injury, death, or discrimination: Comment"," 2(1): 91-96",{"$f":"LEFT(K236,FIND(\"(\",K236,1)-1)","v":" 2"},null,{"$f":"MID(K236,2,1)","v":"2"},{"$f":"MID(K236,4,1)","v":"1"},{"$f":"MID(K236,8,8)","v":"91-96"},null,null,null,null,null,null,null,null,null,null,null,null,null,"Y"]
["Piette","Michael J","Sauer","Douglas G",null,null,null,null,1993," Legal and statistical approaches  to analyzing allegations of employment discrimination"," 3(1): 1-14",{"$f":"LEFT(K237,FIND(\"(\",K237,1)-1)","v":" 3"},null,{"$f":"MID(K237,2,1)","v":"3"},{"$f":"MID(K237,4,1)","v":"1"},{"$f":"MID(K237,8,8)","v":"1-14"},"Y",null,null,null,null,null,null,null,null,"Y"]
["Piette","Michael","Thornton","Janet R",null,null,null,null,1994," Using new labor force participation rates when computing economic damage and loss: A methodological note"," 4(2): 81-88",{"$f":"LEFT(K238,FIND(\"(\",K238,1)-1)","v":" 4"},null,{"$f":"MID(K238,2,1)","v":"4"},{"$f":"MID(K238,4,1)","v":"2"},{"$f":"MID(K238,8,8)","v":"81-88"},"Y",null,null,null,null,null,null,null,null,null,null,"Y"]
["Polhemus","Jennifer L",null,"",null,null,null,null," 2001-2002"," Employment and self-employment: Differences in determining earnings"," 11(3): 87-10",{"$f":"LEFT(K239,FIND(\"(\",K239,1)-1)","v":" 11"},null,{"$f":"MID(K239,2,2)","v":"11"},{"$f":"MID(K239,5,1)","v":"3"},{"$f":"MID(K239,8,7)","v":" 87-10"},null,null,null,null,null,null,null,null,null,null,null,null,"Y"]
["Polhemus","Jennifer",null,"",null,null,null,null,2001," Best websites for financial professionals business appraiser and accountants"," 11(2): 101-104",{"$f":"LEFT(K240,FIND(\"(\",K240,1)-1)","v":" 11"},null,{"$f":"MID(K240,1,2)","v":" 1"},{"$f":"MID(K240,4,1)","v":"("},{"$f":"MID(K240,8,8)","v":" 101-104"},null,null,null,null,null,null,null,null,null,null,null,null,null,"Y"]
["Porter","Stevan D.",null,null,null,null,null,null,2008,"Estimating Hypothetically Negotiated Royalty Rates After MedImmune, Inc. v Genentech, Inc. et al","14 (3): 43-52",{"$f":"LEFT(K241,FIND(\"(\",K241,1)-1)","v":"14 "},null,{"$f":"MID(K241,2,1)","v":"4"},{"$f":"MID(K241,4,1)","v":"("},{"$f":"MID(K241,8,8)","v":" 43-52"},"Y",null,null,null,null,null,null,"Y"]
["Priaulx","Nicolette M.",null,null,null,null,null,null,2008,"A Letter from the UK: Tort Law and Damages for the Unwanted Child","14 (3): 53-79",{"$f":"LEFT(K242,FIND(\"(\",K242,1)-1)","v":"14 "},null,{"$f":"MID(K242,2,1)","v":"4"},{"$f":"MID(K242,4,1)","v":"("},{"$f":"MID(K242,8,8)","v":" 53-79"},null,null,null,null,null,null,null,null,null,null,null,null,null,null,null,"Y"]
["Ray","Clarence G",null,"",null,null,null,null,1991," President's comments: The economic expert and civil litigation"," 1(1): 1-4",{"$f":"LEFT(K243,FIND(\"(\",K243,1)-1)","v":" 1"},null,{"$f":"MID(K243,2,2)","v":"1("},{"$f":"MID(K243,5,1)","v":")"},{"$f":"MID(K243,8,7)","v":"1-4"},null,null,null,null,null,null,null,null,null,null,null,null,"Y"]
["Raymond","Richard",null,"",null,null,null,null,2001," Valuing intellectual assets"," 11(2): 89-100",{"$f":"LEFT(K244,FIND(\"(\",K244,1)-1)","v":" 11"},null,{"$f":"MID(K244,1,3)","v":" 11"},{"$f":"MID(K244,5,1)","v":"2"},{"$f":"MID(K244,8,8)","v":" 89-100"},null,null,null,null,null,null,null,null,null,null,null,null,"Y"]
["Raymond","Richard",null,"",null,null,null,null,2003," Comment: The Valuation of the loss of future pension income"," 13(1): 119-128",{"$f":"LEFT(K245,FIND(\"(\",K245,1)-1)","v":" 13"},null,{"$f":"MID(K245,2,2)","v":"13"},{"$f":"MID(K245,5,1)","v":"1"},{"$f":"MID(K245,8,7)","v":" 119-12"},"Y",null,null,null,null,null,null,null,"Y"]
["Raymond","Richard D",null,"",null,null,null,null,1998," Potential bias in the estimation of future medical care costs: Empirical and conceptual issues"," 8(1): 41-60",{"$f":"LEFT(K246,FIND(\"(\",K246,1)-1)","v":" 8"},null,{"$f":"MID(K246,2,1)","v":"8"},{"$f":"MID(K246,4,1)","v":"1"},{"$f":"MID(K246,8,8)","v":"41-60"},null,null,null,null,null,null,null,null,null,null,null,null,null,"Y"]
["Raymond","Richard D",null,"",null,null,null,null," 1999-2000"," The use, or abuse, of hedonic value-of life estimates in personal injury and death cases"," 9(3): 69-96",{"$f":"LEFT(K247,FIND(\"(\",K247,1)-1)","v":" 9"},null,{"$f":"MID(K247,2,1)","v":"9"},{"$f":"MID(K247,4,1)","v":"3"},{"$f":"MID(K247,8,8)","v":"69-96"},null,null,null,null,null,null,null,null,null,null,null,null,null,"Y"]
["Reaume","David M",null,"",null,null,null,null,1998," Comment: Economic losses from terminated employment"," 8(1): 89-94",{"$f":"LEFT(K248,FIND(\"(\",K248,1)-1)","v":" 8"},null,{"$f":"MID(K248,2,1)","v":"8"},{"$f":"MID(K248,4,1)","v":"1"},{"$f":"MID(K248,8,8)","v":"89-94"},"Y",null,null,null,null,null,null,null,null,null,"Y"]
["Reaume","David M",null,"",null,null,null,null,1999," Nonmarket Services: An offset in certain cases"," 9(1): 1-20",{"$f":"LEFT(K249,FIND(\"(\",K249,1)-1)","v":" 9"},null,{"$f":"MID(K249,2,1)","v":"9"},{"$f":"MID(K249,4,1)","v":"1"},{"$f":"MID(K249,8,8)","v":"1-20"},"Y",null,null,"Y"]
["Reid","Sean F","O'Connor","Matthew l","Shapiro","Steven J",null,null,2006," The valuation of employee stock options issued by closely held firms"," 13(2): 19- 44",{"$f":"LEFT(K250,FIND(\"(\",K250,1)-1)","v":" 13"},null,{"$f":"MID(K250,2,2)","v":"13"},{"$f":"MID(K250,5,1)","v":"2"},{"$f":"MID(K250,8,7)","v":" 19- 44"},"Y",null,null,"Y"]
["Renas","Stephen M","Cebula","Richard J",null,null,null,null,1999," Annuity testimony and the risk of double discounting"," 9(2): 25-32",{"$f":"LEFT(K251,FIND(\"(\",K251,1)-1)","v":" 9"},null,{"$f":"MID(K251,2,1)","v":"9"},{"$f":"MID(K251,4,1)","v":"2"},{"$f":"MID(K251,8,8)","v":"25-32"},"Y","Y"]
["Riccardi","Anthony H","Ireland","Thomas R",null,null,null,null,2000," Structured judgments and periodic payments in New York: A unique and complex system for tort awards"," 10(2): 55-74",{"$f":"LEFT(K252,FIND(\"(\",K252,1)-1)","v":" 10"},null,{"$f":"MID(K252,2,1)","v":"1"},{"$f":"MID(K252,4,1)","v":"("},{"$f":"MID(K252,8,8)","v":" 55-74"},"Y",null,null,null,null,null,null,"Y"]
["Riccardi","Anthony","Ireland","homas",null,null,null,null,"  2002-2003"," A primer on annuity contracts structred settlements and periodic-payment judgements"," 12(3): 1-45",{"$f":"LEFT(K253,FIND(\"(\",K253,1)-1)","v":" 12"},null,{"$f":"MID(K253,2,2)","v":"12"},{"$f":"MID(K253,5,1)","v":"3"},{"$f":"MID(K253,8,7)","v":" 1-45"},"Y",null,null,"Y"]
["Richards","Hugh",null,"",null,null,null,null,1996," A refinement in earnings of never-married females"," 6(2): 77-90",{"$f":"LEFT(K254,FIND(\"(\",K254,1)-1)","v":" 6"},null,{"$f":"MID(K254,2,1)","v":"6"},{"$f":"MID(K254,4,1)","v":"2"},{"$f":"MID(K254,8,8)","v":"77-90"},null,null,null,null,null,null,null,null,null,null,null,null,"Y"]
["Richards","Hugh",null,"",null,null,null,null,1998," Parameters for estimation of earnings loss of Hispanics: Life and work-life expectancies unemployement rates, and levels  of earnings by English language Proficiency"," 8(2): 63-96",{"$f":"LEFT(K255,FIND(\"(\",K255,1)-1)","v":" 8"},null,{"$f":"MID(K255,2,1)","v":"8"},{"$f":"MID(K255,4,1)","v":"2"},{"$f":"MID(K255,8,8)","v":"63-96"},null,null,null,null,null,null,null,null,null,null,null,null,null,null,null,"Y"]
["Riley","Neil F","Stanton","Thomas C",null,null,null,null,1993," Factors used to determine marketability, illiquidity, and minority interest discounts in the valuation of closely held corporations: An analysis of Federal Tax Court decisions."," 3(3): 87-100",{"$f":"LEFT(K256,FIND(\"(\",K256,1)-1)","v":" 3"},null,{"$f":"MID(K256,2,1)","v":"3"},{"$f":"MID(K256,4,1)","v":"3"},{"$f":"MID(K256,8,8)","v":"87-100"},"Y",null,null,null,null,null,"Y"]
["Rodgers","James D","Thornton","Robert J",null,null,null,null,1998," Making operational the concept of maintenance consumption."," 8(1): 1-40",{"$f":"LEFT(K257,FIND(\"(\",K257,1)-1)","v":" 8"},null,{"$f":"MID(K257,2,1)","v":"8"},{"$f":"MID(K257,4,1)","v":"1"},{"$f":"MID(K257,8,8)","v":"1-40"},"Y",null,null,"Y"]
["Rogers","Walter B","Fayissa B W Balch","Bichaka",null,null,null,null,1991," Variations in the economic estimation of personal injury and wrongful death claims"," 1(1): 81-88",{"$f":"LEFT(K258,FIND(\"(\",K258,1)-1)","v":" 1"},null,{"$f":"MID(K258,2,2)","v":"1("},{"$f":"MID(K258,5,1)","v":")"},{"$f":"MID(K258,8,7)","v":"81-88"},null,null,null,null,null,null,null,null,null,null,null,null,null,null,null,"Y"]
["Romans","Thomas J","Floss","Frederick G",null,null,null,null,1993," The estimation of retirement age in the calculation of earnings loss"," 3(2): 25-32",{"$f":"LEFT(K259,FIND(\"(\",K259,1)-1)","v":" 3"},null,{"$f":"MID(K259,2,1)","v":"3"},{"$f":"MID(K259,4,1)","v":"2"},{"$f":"MID(K259,8,8)","v":"25-32"},null,null,null,null,null,null,null,null,null,null,null,null,null,null,null,"Y"]
["Romans","Thomas J","Floss","Frederick G",null,null,null,null,1997," Measuring economic loss for the self-employed"," 7(2): 1-14",{"$f":"LEFT(K260,FIND(\"(\",K260,1)-1)","v":" 7"},null,{"$f":"MID(K260,2,1)","v":"7"},{"$f":"MID(K260,4,1)","v":"2"},{"$f":"MID(K260,8,8)","v":"1-14"},null,null,null,null,null,null,null,null,null,null,null,null,null,"Y"]
["Rosenbaum","David I","Guthmann J","Michael",null,null,null,null,2007," Net Discount Rates: Does Duration Matter"," 14(2): 1-24",{"$f":"LEFT(K261,FIND(\"(\",K261,1)-1)","v":" 14"},null,{"$f":"MID(K261,2,2)","v":"14"},{"$f":"MID(K261,5,1)","v":"2"},{"$f":"MID(K261,8,7)","v":" 1-24"},null,null,null,null,null,null,null,null,null,null,null,null,null,null,null,"Y"]
["Rosenbaum","David I.","Guthmann","J. Michael",null,null,null,null,2008,"Errata: Net Discount Rates: Does Duration Matter?","14 (3):111-112",{"$f":"LEFT(K262,FIND(\"(\",K262,1)-1)","v":"14 "},null,{"$f":"MID(K262,2,1)","v":"4"},{"$f":"MID(K262,4,1)","v":"("},{"$f":"MID(K262,8,8)","v":"111-112"},null,null,null,null,null,null,null,null,null,null,null,null,null,"Y"]
["Ross","Peter",null,"",null,null,null,null,1992," Loss of marriage ability (Loss of permanent interdependent relationship)"," 2(2): 49-50",{"$f":"LEFT(K263,FIND(\"(\",K263,1)-1)","v":" 2"},null,{"$f":"MID(K263,2,1)","v":"2"},{"$f":"MID(K263,4,1)","v":"2"},{"$f":"MID(K263,8,8)","v":"49-50"},"Y",null,null,null,"Y"]
["Ross","Peter",null,"",null,null,null,null,1995," Divorce—Canadian style: Compensatory support"," 5(2): 67-70",{"$f":"LEFT(K264,FIND(\"(\",K264,1)-1)","v":" 5"},null,{"$f":"MID(K264,2,1)","v":"5"},{"$f":"MID(K264,4,1)","v":"2"},{"$f":"MID(K264,8,8)","v":"67-70"},null,null,null,null,null,null,null,null,null,null,null,null,null,null,null,"Y"]
["Roth","Timothy P",null,"",null,null,null,null,1995," Predation, cost-based tests and predatory intent"," 5(1): 35-47",{"$f":"LEFT(K265,FIND(\"(\",K265,1)-1)","v":" 5"},null,{"$f":"MID(K265,2,1)","v":"5"},{"$f":"MID(K265,4,1)","v":"1"},{"$f":"MID(K265,8,8)","v":"35-47"},null,null,null,null,null,null,null,null,null,null,null,null,"Y"]
["Salazar-Carrillo","Jorge",null,"",null,null,null,null," 1996-1997"," Comment on \"Purchasing power parity or official exchange rates for international settlements: A Central American case\""," 6(3): 71-74",{"$f":"LEFT(K266,FIND(\"(\",K266,1)-1)","v":" 6"},null,{"$f":"MID(K266,2,1)","v":"6"},{"$f":"MID(K266,4,1)","v":"3"},{"$f":"MID(K266,8,8)","v":"71-74"},"Y",null,null,"Y"]
["Schieren","George A",null,"",null,null,null,null,1994," On using minimum-cost portfolios to determine  present value"," 4(1): 47-59",{"$f":"LEFT(K267,FIND(\"(\",K267,1)-1)","v":" 4"},null,{"$f":"MID(K267,2,1)","v":"4"},{"$f":"MID(K267,4,1)","v":"1"},{"$f":"MID(K267,8,8)","v":"47-59"},null,null,null,null,null,null,null,null,null,null,null,null,null,null,null,"Y"]
["Schieren","George A",null,"",null,null,null,null,1994," Is there an advantage in using time-series to forecast lost earnings?"," 4(3): 43-53",{"$f":"LEFT(K268,FIND(\"(\",K268,1)-1)","v":" 4"},null,{"$f":"MID(K268,2,1)","v":"4"},{"$f":"MID(K268,4,1)","v":"3"},{"$f":"MID(K268,8,8)","v":"43-53"},null,null,null,null,null,null,null,null,null,null,null,null,null,"Y"]
["Simmons","Richard W","Hoyt","Richard C",null,null,null,null,1993," Economic damage analysis in Rule 10b-5 securities litigations"," 3(1): 71-88",{"$f":"LEFT(K269,FIND(\"(\",K269,1)-1)","v":" 3"},null,{"$f":"MID(K269,2,1)","v":"3"},{"$f":"MID(K269,4,1)","v":"1"},{"$f":"MID(K269,8,8)","v":"71-88"},null,null,null,null,null,null,null,null,null,null,null,null,null,null,null,"Y"]
["Simmons","Walter Orlando",null,"",null,null,null,null,1996," An economic analysis of mandatory mediation and the disposition of medical malpractice claims"," 6(2): 41-70",{"$f":"LEFT(K270,FIND(\"(\",K270,1)-1)","v":" 6"},null,{"$f":"MID(K270,2,1)","v":"6"},{"$f":"MID(K270,4,1)","v":"2"},{"$f":"MID(K270,8,8)","v":"41-70"},null,null,null,null,null,null,null,null,null,null,null,null,null,null,null,"Y"]
["Skoog","Gary R","Ciecka","ames E",null,null,null,null,2001," A Markov (increment-decrement) model of labor force activity: New results beyond work-life expectancies"," 11(1): 1-22",{"$f":"LEFT(K271,FIND(\"(\",K271,1)-1)","v":" 11"},null,{"$f":"MID(K271,1,3)","v":" 11"},{"$f":"MID(K271,5,1)","v":"1"},{"$f":"MID(K271,8,8)","v":" 1-22"},null,null,null,null,null,null,null,null,null,null,null,null,null,null,"Y"]
["Skoog","Gary R","Ciecka","ames E",null,null,null,null,2001," A Markov (increment-decrement) model of labor force activity: Extended tables of central tendency, variation, and probability intervals"," 11(1): 23-87",{"$f":"LEFT(K272,FIND(\"(\",K272,1)-1)","v":" 11"},null,{"$f":"MID(K272,1,2)","v":" 1"},{"$f":"MID(K272,4,1)","v":"("},{"$f":"MID(K272,8,8)","v":" 23-87"},null,null,null,null,null,null,null,null,null,null,null,null,null,"Y"]
["Slesinger","Reuben E",null,"",null,null,null,null,1991," How economists can help in litigation involving personal injury, death, or discrimination."," 1(1): 67-80",{"$f":"LEFT(K273,FIND(\"(\",K273,1)-1)","v":" 1"},null,{"$f":"MID(K273,2,2)","v":"1("},{"$f":"MID(K273,5,1)","v":")"},{"$f":"MID(K273,8,7)","v":"67-80"},null,null,null,null,null,null,null,null,null,null,null,null,"Y"]
["Slesinger","Reuben E",null,"",null,null,null,null,1992," How economists can help in litigation involving personal injury, death, or discrimination: Response"," 2(1): 97-98",{"$f":"LEFT(K274,FIND(\"(\",K274,1)-1)","v":" 2"},null,{"$f":"MID(K274,2,1)","v":"2"},{"$f":"MID(K274,4,1)","v":"1"},{"$f":"MID(K274,8,8)","v":"97-98"},"Y",null,null,"Y"]
["Slesinger","Reuben E",null,"",null,null,null,null,1996," The demise of hedonic damages claims in tort litigation"," 6(2): 17-28",{"$f":"LEFT(K275,FIND(\"(\",K275,1)-1)","v":" 6"},null,{"$f":"MID(K275,2,1)","v":"6"},{"$f":"MID(K275,4,1)","v":"2"},{"$f":"MID(K275,8,8)","v":"17-28"},null,null,null,null,null,null,null,null,null,null,null,null,null,null,null,"Y"]
["Slesinger","Reuben E",null,"",null,null,null,null,1997," The latest nail in the hedonic coffin"," 7(2): 87- 90",{"$f":"LEFT(K276,FIND(\"(\",K276,1)-1)","v":" 7"},null,{"$f":"MID(K276,2,1)","v":"7"},{"$f":"MID(K276,4,1)","v":"2"},{"$f":"MID(K276,8,8)","v":"87- 90"},null,null,null,null,null,null,null,null,null,null,null,null,null,"Y"]
["Speicher","Brian",null,null,null,null,null,null,2008,"Sleeping Time and the Twenty-Four-Hour Day Time Budget Constraint: Tools in Forensic Economic Analysis"," 15(1):  87-91",{"$f":"LEFT(K277,FIND(\"(\",K277,1)-1)","v":" 15"},null,{"$f":"MID(K277,2,2)","v":"15"},{"$f":"MID(K277,5,1)","v":"1"},{"$f":"MID(K277,8,8)","v":"  87-91"},null,null,null,null,null,null,null,null,null,null,null,null,"Y"]
["Spizman","Lawrence M",null,"",null,null,null,null," 2001-2002"," The economist's role in Equal Pay Act litigation"," 11(3): 69-86",{"$f":"LEFT(K278,FIND(\"(\",K278,1)-1)","v":" 11"},null,{"$f":"MID(K278,2,2)","v":"11"},{"$f":"MID(K278,5,1)","v":"3"},{"$f":"MID(K278,8,7)","v":" 69-86"},null,null,null,null,null,null,null,null,null,null,null,null,null,null,null,"Y"]
["Spizman","Lawrence","Floss","Frederick G",null,null,null,null,2002,"Loss of earning capacity in wrongful death or major"," 12(1): 7-21",{"$f":"LEFT(K279,FIND(\"(\",K279,1)-1)","v":" 12"},null,{"$f":"MID(K279,2,2)","v":"12"},{"$f":"MID(K279,5,1)","v":"1"},{"$f":"MID(K279,8,7)","v":" 7-21"},"Y",null,"Y"]
["Spizman","Lawrence","Weinstein","Marc A.",null,null,null,null,2008,"A Note on Utilizing the Geometric Mean: When, Why and How the Forensic Economist Should Employ the Geometric Mean"," 15(1): 43-55",{"$f":"LEFT(K280,FIND(\"(\",K280,1)-1)","v":" 15"},null,{"$f":"MID(K280,2,2)","v":"15"},{"$f":"MID(K280,5,1)","v":"1"},{"$f":"MID(K280,8,8)","v":" 43-55"},null,null,null,null,null,null,null,null,null,null,null,null,null,null,null,"Y"]
["Spizman","Lawrence M",null,"",null,null,null,null,1995," The defense economist's role in litigation settlement negotiations"," 5(2): 57-65",{"$f":"LEFT(K281,FIND(\"(\",K281,1)-1)","v":" 5"},null,{"$f":"MID(K281,2,1)","v":"5"},{"$f":"MID(K281,4,1)","v":"2"},{"$f":"MID(K281,8,8)","v":"57-65"},null,null,null,null,null,null,null,null,null,null,null,null,null,null,null,"Y"]
["Stano","Miron","Hotelling","Harold",null,null,null,null,1991," Regression analysis in litigation:  Some overlooked considerations"," 1(3): 68-78",{"$f":"LEFT(K282,FIND(\"(\",K282,1)-1)","v":" 1"},null,{"$f":"MID(K282,2,2)","v":"1("},{"$f":"MID(K282,5,1)","v":")"},{"$f":"MID(K282,8,7)","v":"68-78"},null,null,null,null,null,null,null,null,null,null,null,null,null,"Y"]
["Stauffer","Robert F","Lynch","Larry A",null,null,null,null,2001," Determining spousal support in divorce cases"," 10(3): 37-52",{"$f":"LEFT(K283,FIND(\"(\",K283,1)-1)","v":" 10"},null,{"$f":"MID(K283,1,2)","v":" 1"},{"$f":"MID(K283,5,1)","v":"3"},{"$f":"MID(K283,8,8)","v":" 37-52"},null,null,null,null,null,null,null,null,null,null,null,null,"Y"]
["Steen","Charles H",null,"",null,null,null,null,1994," The econometrics of 'Fraud-on-the-Market' securities fraud"," 4(1): 11-45",{"$f":"LEFT(K284,FIND(\"(\",K284,1)-1)","v":" 4"},null,{"$f":"MID(K284,2,1)","v":"4"},{"$f":"MID(K284,4,1)","v":"1"},{"$f":"MID(K284,8,8)","v":"11-45"},"Y",null,null,"Y"]
["Stephan","Paul B",null,"",null,null,null,null,1992," Further reflections on the implementation of comparative advantage principles in trade law"," 2(2): 111-120",{"$f":"LEFT(K285,FIND(\"(\",K285,1)-1)","v":" 2"},null,{"$f":"MID(K285,2,1)","v":"2"},{"$f":"MID(K285,4,1)","v":"2"},{"$f":"MID(K285,8,8)","v":"111-120"},"Y",null,null,null,"Y"]
["Stoller","Michael A",null,"",null,null,null,null,1992," Estimating the present value of pensions: Why different estimators get varying results"," 2(3): 49-62",{"$f":"LEFT(K286,FIND(\"(\",K286,1)-1)","v":" 2"},null,{"$f":"MID(K286,2,1)","v":"2"},{"$f":"MID(K286,4,1)","v":"3"},{"$f":"MID(K286,8,8)","v":"49-62"},"Y",null,null,null,null,null,null,null,null,null,null,"Y"]
["Strangways","Raymond S","Zugelder","Michael T",null,null,null,null,1998," General versus the specific: Forecasting wage growth in injury and death cases"," 8(2): 1- 24",{"$f":"LEFT(K287,FIND(\"(\",K287,1)-1)","v":" 8"},null,{"$f":"MID(K287,2,1)","v":"8"},{"$f":"MID(K287,4,1)","v":"2"},{"$f":"MID(K287,8,8)","v":"1- 24"},"Y",null,null,"Y"]
["Swan","Alan C",null,"",null,null,null,null,1992," GATT and the evolution of United States trade law: Comments"," 2(2): 121-126",{"$f":"LEFT(K288,FIND(\"(\",K288,1)-1)","v":" 2"},null,{"$f":"MID(K288,2,1)","v":"2"},{"$f":"MID(K288,4,1)","v":"2"},{"$f":"MID(K288,8,8)","v":"121-126"},null,null,null,null,null,null,null,null,null,null,null,null,null,null,null,"Y"]
["Taylor","Paul","Taylor","Laura J",null,null,null,null,2007," Evaluating the Financial Cost of Involuntary Military Separation"," 14(1): 1-22",{"$f":"LEFT(K289,FIND(\"(\",K289,1)-1)","v":" 14"},null,{"$f":"MID(K289,2,2)","v":"14"},{"$f":"MID(K289,5,1)","v":"1"},{"$f":"MID(K289,8,7)","v":" 1-22"},null,null,null,null,null,null,null,null,null,null,null,null,null,null,null,"Y"]
["Throckmorton","Bruce H",null,"",null,null,null,null,1995," A note on defined benefit retirement plans as a marital asset in divorce: The Tennessee case"," 5(2): 77-83",{"$f":"LEFT(K290,FIND(\"(\",K290,1)-1)","v":" 5"},null,{"$f":"MID(K290,2,1)","v":"5"},{"$f":"MID(K290,4,1)","v":"2"},{"$f":"MID(K290,8,8)","v":"77-83"},null,null,null,null,null,null,null,null,null,null,null,null,"Y"]
["Tinari","Frank D",null,"",null,null,null,null,1995," Do we double count damages in severe personal injury cases"," 5(2): 23-32",{"$f":"LEFT(K291,FIND(\"(\",K291,1)-1)","v":" 5"},null,{"$f":"MID(K291,2,1)","v":"5"},{"$f":"MID(K291,4,1)","v":"2"},{"$f":"MID(K291,8,8)","v":"23-32"},null,null,null,null,null,null,null,null,null,null,null,null,null,null,null,"Y"]
["Tinari","Frank D",null,"",null,null,null,null," 1998-1999"," Book Review: The dollar value of a day: 1997 dollar valuation"," 8(3): 93-100",{"$f":"LEFT(K292,FIND(\"(\",K292,1)-1)","v":" 8"},null,{"$f":"MID(K292,2,1)","v":"8"},{"$f":"MID(K292,4,1)","v":"3"},{"$f":"MID(K292,8,8)","v":"93-100"},"Y",null,null,"Y"]
["Tinari","Frank D",null,"",null,null,null,null,1999," The dollar value of a day: 1997 dollar valuation"," 9(1): 93-93",{"$f":"LEFT(K293,FIND(\"(\",K293,1)-1)","v":" 9"},null,{"$f":"MID(K293,2,1)","v":"9"},{"$f":"MID(K293,4,1)","v":"1"},{"$f":"MID(K293,8,8)","v":"93-93"},"Y",null,null,null,null,"Y"]
["Topino","David C","Latham","Joanne ","Hawk","Rachel ","Green","Susan ",2002," Valuation of Pediatric Wage Loss: A Vocational Note"," 12(1): 1-5",{"$f":"LEFT(K294,FIND(\"(\",K294,1)-1)","v":" 12"},null,{"$f":"MID(K294,2,2)","v":"12"},{"$f":"MID(K294,5,1)","v":"1"},{"$f":"MID(K294,8,7)","v":" 1-5"},"Y"]
["Toppino","David C","Male","Robert ",null,null,null,null," 2001-2002"," Economic foundations for employment case analyses"," 11(3): 25-38",{"$f":"LEFT(K295,FIND(\"(\",K295,1)-1)","v":" 11"},null,{"$f":"MID(K295,2,2)","v":"11"},{"$f":"MID(K295,5,1)","v":"3"},{"$f":"MID(K295,8,7)","v":" 25-38"},"Y",null,null,null,null,null,null,"Y"]
["Toppino","David","Boyd","Dawn",null,null,null,null,1993," Wage loss analysis: Vocational expert foundation and methodology"," 3(2): 69-80",{"$f":"LEFT(K296,FIND(\"(\",K296,1)-1)","v":" 3"},null,{"$f":"MID(K296,1,1)","v":" "},{"$f":"MID(K296,3,1)","v":"("},{"$f":"MID(K296,8,8)","v":"69-80"},"Y",null,null,"Y"]
["Trevino","Gene A",null,"",null,null,null,null,2000," An evaluation of real earnings growth based on US Census P-60 data"," 10(1): 47-60",{"$f":"LEFT(K297,FIND(\"(\",K297,1)-1)","v":" 10"},null,{"$f":"MID(K297,2,1)","v":"1"},{"$f":"MID(K297,4,1)","v":"("},{"$f":"MID(K297,8,8)","v":" 47-60"},"Y",null,null,null,null,null,null,"Y"]
["Trevino","Gene A",null,"",null,null,null,null," 1997-1998"," A note on formulating and corroborating discount rates for small firms"," 7(3): 45-54",{"$f":"LEFT(K298,FIND(\"(\",K298,1)-1)","v":" 7"},null,{"$f":"MID(K298,2,1)","v":"7"},{"$f":"MID(K298,4,1)","v":"3"},{"$f":"MID(K298,8,8)","v":"45-54"},"Y",null,null,null,"Y"]
["Trevino","Gene A",null,"",null,null,null,null,1997," Calculating the earnings base for a self-employed individual"," 7(2): 43-50",{"$f":"LEFT(K299,FIND(\"(\",K299,1)-1)","v":" 7"},null,{"$f":"MID(K299,2,1)","v":"7"},{"$f":"MID(K299,4,1)","v":"2"},{"$f":"MID(K299,8,8)","v":"43-50"},null,null,null,"Y"]
["Trivoli","George W","Scroggins","illiam A","Graham","Robert G",null,null," 1998-1999"," The impact of interest fluctuations and portfolio management assumptions on the projected discount rate"," 8(3): 67-80",{"$f":"LEFT(K300,FIND(\"(\",K300,1)-1)","v":" 8"},null,{"$f":"MID(K300,2,1)","v":"8"},{"$f":"MID(K300,4,1)","v":"3"},{"$f":"MID(K300,8,8)","v":"67-80"}]
["Trout","Robert R",null,"",null,null,null,null,1991," Does economic testimony affect damage awards? "," 1(1): 43-50",{"$f":"LEFT(K301,FIND(\"(\",K301,1)-1)","v":" 1"},null,{"$f":"MID(K301,2,2)","v":"1("},{"$f":"MID(K301,5,1)","v":")"},{"$f":"MID(K301,8,7)","v":"43-50"},null,null,null,null,null,null,null,null,null,null,null,null,"Y"]
["Trout","Robert R",null,"",null,null,null,null,1992," Minority discounts and control premiums: A synthesis"," 2(1): 17-24",{"$f":"LEFT(K302,FIND(\"(\",K302,1)-1)","v":" 2"},null,{"$f":"MID(K302,2,1)","v":"2"},{"$f":"MID(K302,4,1)","v":"1"},{"$f":"MID(K302,8,8)","v":"17-24"},"Y",null,null,null,null,null,null,null,null,"Y"]
["Trout","Robert R","Foster","C B","McCollister","G M",null,null,1993," Applications of logit analysis in civil litigation"," 3(1): 33-52",{"$f":"LEFT(K303,FIND(\"(\",K303,1)-1)","v":" 3"},null,{"$f":"MID(K303,2,1)","v":"3"},{"$f":"MID(K303,4,1)","v":"1"},{"$f":"MID(K303,8,8)","v":"33-52"},null,null,null,null,null,null,null,null,null,null,null,null,null,null,null,"Y"]
["Trout","Robert R",null,"",null,null,null,null,1994," Comment: Valuation of vested pension benefits"," 4(1): 83-85",{"$f":"LEFT(K304,FIND(\"(\",K304,1)-1)","v":" 4"},null,{"$f":"MID(K304,2,1)","v":"4"},{"$f":"MID(K304,4,1)","v":"1"},{"$f":"MID(K304,8,8)","v":"83-85"},"Y",null,null,"Y"]
["Tullock","Gordon",null,"",null,null,null,null,1992," Court errors "," 2(2): 57-70",{"$f":"LEFT(K305,FIND(\"(\",K305,1)-1)","v":" 2"},null,{"$f":"MID(K305,2,1)","v":"2"},{"$f":"MID(K305,4,1)","v":"2"},{"$f":"MID(K305,8,8)","v":"57-70"},null,null,null,null,null,null,null,null,null,null,null,"Y"]
["Udinsky","Jerald",null,"",null,null,null,null," 1997-1998"," Book Review: The abc's of rehabilitation economics"," 7(3): 77-80",{"$f":"LEFT(K306,FIND(\"(\",K306,1)-1)","v":" 7"},null,{"$f":"MID(K306,2,1)","v":"7"},{"$f":"MID(K306,4,1)","v":"3"},{"$f":"MID(K306,8,8)","v":"77-80"},null,null,null,null,null,null,null,null,null,null,null,null,null,"Y"]
["Ulen","Thomas S",null,"",null,null,null,null,1992," The lessons of law and economics"," 2(3): 103-130",{"$f":"LEFT(K307,FIND(\"(\",K307,1)-1)","v":" 2"},null,{"$f":"MID(K307,2,1)","v":"2"},{"$f":"MID(K307,4,1)","v":"3"},{"$f":"MID(K307,8,8)","v":"103-130"},null,null,null,null,null,null,null,null,null,null,null,null,null,null,null,"Y"]
["Wald","John",null,"",null,null,null,null,1994," Determining an optimal rule for lost income compensation"," 4(3): 63-72",{"$f":"LEFT(K308,FIND(\"(\",K308,1)-1)","v":" 4"},null,{"$f":"MID(K308,2,1)","v":"4"},{"$f":"MID(K308,4,1)","v":"3"},{"$f":"MID(K308,8,8)","v":"63-72"},null,null,null,null,null,null,null,null,null,null,null,null,null,"Y"]
["Weiss","Lawrence A",null,"",null,null,null,null,1992," Bankruptcy in corporate America: Direct costsand enforcement of claims"," 2(2): 79-94",{"$f":"LEFT(K309,FIND(\"(\",K309,1)-1)","v":" 2"},null,{"$f":"MID(K309,2,1)","v":"2"},{"$f":"MID(K309,4,1)","v":"2"},{"$f":"MID(K309,8,8)","v":"79-94"},null,null,null,null,null,null,null,null,null,null,null,null,null,null,null,"Y"]
["Weisskoff","Richard",null,"",null,null,null,null,1993," Purchasing power parity or official exchange rates for international settlements: A Central American case"," 3(2): 33-52",{"$f":"LEFT(K310,FIND(\"(\",K310,1)-1)","v":" 3"},null,{"$f":"MID(K310,2,1)","v":"3"},{"$f":"MID(K310,4,1)","v":"2"},{"$f":"MID(K310,8,8)","v":"33-52"},null,null,null,null,null,null,null,null,null,null,null,null,null,null,null,"Y"]
["White","Michelle J",null,"",null,null,null,null,1992," Measuring deviations from absolute priority in chapter 11 bankruptcy"," 2(2): 71-78",{"$f":"LEFT(K311,FIND(\"(\",K311,1)-1)","v":" 2"},null,{"$f":"MID(K311,2,1)","v":"2"},{"$f":"MID(K311,4,1)","v":"2"},{"$f":"MID(K311,8,8)","v":"71-78"},null,null,null,null,null,null,null,null,null,null,null,null,null,null,null,"Y"]
["Wise","Donald E",null,"",null,null,null,null,1999," A note on calculating transition probabilities from work-life expectancies"," 9(1): 1-20",{"$f":"LEFT(K312,FIND(\"(\",K312,1)-1)","v":" 9"},null,{"$f":"MID(K312,2,1)","v":"9"},{"$f":"MID(K312,4,1)","v":"1"},{"$f":"MID(K312,8,8)","v":"1-20"},null,null,null,null,null,null,null,null,null,null,null,null,null,null,"Y"]
["Woodside","Perry B","Wiggings","Donald C","Venn","John J",null,null,1991," Assessing lost earning capacity for an injured minor."," 1(3): 95-102",{"$f":"LEFT(K313,FIND(\"(\",K313,1)-1)","v":" 1"},null,{"$f":"MID(K313,2,2)","v":"1("},{"$f":"MID(K313,5,1)","v":")"},{"$f":"MID(K313,8,7)","v":"95-102"},"Y",null,null,null,null,null,null,null,"Y"]
["Wyrick","Thomas L",null,"",null,null,null,null,1993," The economic value of parental guidance"," 3(2): 81-94",{"$f":"LEFT(K314,FIND(\"(\",K314,1)-1)","v":" 3"},null,{"$f":"MID(K314,2,1)","v":"3"},{"$f":"MID(K314,4,1)","v":"2"},{"$f":"MID(K314,8,8)","v":"81-94"},"Y",null,null,null,null,"Y"]
["Yandell","Dirk",null,"",null,null,null,null,1991," The value of lost future earnings: Methodology discount rate and economic theory"," 1(3): 54-67",{"$f":"LEFT(K315,FIND(\"(\",K315,1)-1)","v":" 1"},null,{"$f":"MID(K315,2,2)","v":"1("},{"$f":"MID(K315,5,1)","v":")"},{"$f":"MID(K315,8,7)","v":"54-67"},"Y",null,null,"Y"]
["Yandell","Dirk",null,"",null,null,null,null,1995," Advantages and disadvantages of structured settlements"," 5(2): 71-76",{"$f":"LEFT(K316,FIND(\"(\",K316,1)-1)","v":" 5"},null,{"$f":"MID(K316,2,1)","v":"5"},{"$f":"MID(K316,4,1)","v":"2"},{"$f":"MID(K316,8,8)","v":"71-76"},"Y",null,null,"Y"]
["Young","Shik C",null,"",null,null,null,null,1995," Personal consumption during retirement in wrongful death analysis"," 5(3): 69-80",{"$f":"LEFT(K317,FIND(\"(\",K317,1)-1)","v":" 5"},null,{"$f":"MID(K317,2,1)","v":"5"},{"$f":"MID(K317,4,1)","v":"3"},{"$f":"MID(K317,8,8)","v":"69-80"},"Y",null,null,"Y"]

{"sheet":"Texttocolumns","index":9,"n_rows":42,"n_cols":20,"rows_kept":42,"cut":false,"hidden":false,"merged":[]}
["SOCIAL SCIENCES, HELPING PROF",38795,39,38695,38.5,37719,39.4,36769,41.5,35797,42.6,"152.5/",null,35422]
["African American Studies ",88,0.1,56,0.1,64,0.1,57,0.1,56,0.1,"148.9/ ",null,55,null,null,null,null,null," "]
["American Civilization ",82,0.1,81,0.1,45,0,50,0.1,46,0.1,"158.5/ ",null,45,null,null,null,null,null," "]
["Asian American Studies ",0,0,14,0,10,0,20,0,20,0,"153.4/ ",null,20,null,null,null,null,null," "]
["Anthropology ",613,0.6,624,0.6,570,0.6,543,0.6,490,0.6,"156.4/ ",null,490,null,null,null,null,null," "]
["Archaeology ",13,0,11,0,13,0,9,0,8,0,"158.3/ ",null,8,null,null,null,null,null," "]
["Bilingual Education ",3,0,3,0,3,0,2,0,3,0,"142.7/ ",null,3,null,null,null,null,null," "]
["Criminal Justice ",3475,3.5,3386,3.4,3355,3.5,3286,3.7,3272,3.9,"145.5/",null,3239]
["Criminology ",600,0.6,634,0.6,647,0.7,671,0.8,751,0.9,"149.5/ ",null,745,null,null,null,null,null," "]
["Education, General ",161,0.2,154,0.2,156,0.2,165,0.2,147,0.2,"148.6/ ",null,141,null,null,null,null,null," "]
["Education/Administration ",2,0,8,0,9,0,6,0,7,0,"142.3/ ",null,7,null,null,null,null,null," "]
["Education Psychology ",12,0,6,0,8,0,4,0,5,0,"151. 6/ ",null,5,null,null,null,null,null," "]
["Elementary Education ",258,0.3,221,0.2,167,0.2,153,0.2,142,0.2,"148.8/ ",null,136,null,null,null,null,null," "]
["Family Relations/Child Deve ",123,0.1,118,0.1,126,0.1,89,0.1,95,0.1,"151.3/ ",null,92,null,null,null,null,null," "]
["Government /Service",819,0.8,682,0.7,694,0.7,646,0.7,596,0.7,"156.0/ ",null,588,null,null,null,null,null," "]
["Guidance/Counseling ",18,0,11,0,9,0,5,0,3,0,"139.0/ ",null,2,null,null,null,null,null," "]
["History ",4754,4.8,4525,4.5,4510,4.7,4460,5,4390,5.2,"155.9/",null,4351]
["Indian Studies ",10,0,5,0,5,0,7,0,5,0,"139.0/ ",null,5,null,null,null,null,null," "]
["International Relations ",1565,1.6,1609,1.6,1531,1.6,1604,1.8,1544,1.8,"156.7/",null,1536]
["Inter American Relations ",13,0,9,0,10,0,10,0,16,0,"155.8/ ",null,15,null,null,null,null,null," "]
["Law Enforcement ",50,0.1,40,0,33,0,26,0,30,0,"146.1/ ",null,30,null,null,null,null,null," "]
["Mexican American Studies ",14,0,12,0,13,0,16,0,11,0,"147.9/ ",null,10,null,null,null,null,null," "]
["Military Science ",0,0,1,0,0,0,1,0,2,0,"154.0/ ",null,2,null,null,null,null,null," "]
["Office Systems ",0,0,0,0,1,0,1,0,2,0,"138.0/ ",null,2,null,null,null,null,null," "]
["Physical Education ",34,0,27,0,28,0,17,0,13,0,"142.8/ ",null,13,null,null,null,null,null," "]
["Police Administration ",13,0,7,0,4,0,7,0,8,0,"139.9/ ",null,8,null,null,null,null,null," "]
["Policy Studies ",269,0.3,304,0.3,283,0.3,266,0.3,245,0.3,"159.6/ ",null,241,null,null,null,null,null," "]
["Political Science ",15180,15.3,15763,15.7,15509,16.2,15361,17.3,14950,17.8,"153.0/",null,14802]
["Prelaw ",870,0.9,984,1,976,1,1003,1.1000000000000001,1057,1.3,"148.7/",null,1047]
["Psychology ",5206,5.2,5155,5.0999999999999996,4943,5.2,4601,5.2,4350,5.2,"152.9/",null,4306]
["Public Affairs/Services/Adm ",234,0.2,204,0.2,185,0.2,174,0.2,172,0.2,"149.7/ ",null,171,null,null,null,null,null," "]
["Recreation and Leisure Serv ",28,0,33,0,35,0,17,0,16,0,"147.9/ ",null,15,null,null,null,null,null," "]
["Secondary Education ",162,0.2,152,0.2,138,0.1,110,0.1,115,0.1,"151.1/ ",null,112,null,null,null,null,null," "]
["Sociology ",2326,2.2999999999999998,2293,2.2999999999999998,2171,2.2999999999999998,2125,2.4,2042,2.4,"150.8/",null,2015]
["Social Work ",354,0.4,347,0.3,334,0.3,264,0.3,241,0.3,"147.0/ ",null,239,null,null,null,null,null," "]
["Spec. Ed./Disabi1ities/Hndc ",45,0,39,0,46,0,39,0,25,0,"148.0/ ",null,23,null,null,null,null,null," "]
["Urban Studies/Regn1. P1anni ",116,0.1,100,0.1,98,0.1,78,0.1,84,0.1,"155.9/ ",null,83,null,null,null,null,null," "]
["Women's Studies ",101,0.1,79,0.1,84,0.1,90,0.1,94,0.1,"156.0/ ",null,94,null,null,null,null,null," "]
["Other Social Sciences ",1184,1.2,998,1,906,0.9,786,0.9,744,0.9,"152.0/ ",null,726,null,null,null,null,null," "]
["OTHER ",4589,4.5999999999999996,4751,4.7,4754,5,4536,5.0999999999999996,4429,5.3,"148.8/",null,4342]
["Any area not ",4589,4.5999999999999996,4751,4.7,4754,5,4536,5.0999999999999996,4429,5.3,"148.8/",null,4343]
["NO MAJOR INDICATED ",5643,5.7,4778,4.7,3990,4.2,3175,3.6,2632,3.1,"144.5/",null,1816]

{"sheet":"EasyFilter","index":10,"n_rows":25,"n_cols":4,"rows_kept":25,"cut":false,"hidden":false,"merged":[]}
["year","Month","Quarter","Monthlysales"]
[2000,1,{"$f":"IF(B2<=3,1,IF(B2<=6,2,IF(B2<=9,3,IF(B2<=12,4,\"x\"))))","v":1},84]
[2000,2,{"$f":"IF(B3<=3,1,IF(B3<=6,2,IF(B3<=9,3,IF(B3<=12,4,\"x\"))))","v":1},36]
[2000,3,{"$f":"IF(B4<=3,1,IF(B4<=6,2,IF(B4<=9,3,IF(B4<=12,4,\"x\"))))","v":1},13]
[2000,4,{"$f":"IF(B5<=3,1,IF(B5<=6,2,IF(B5<=9,3,IF(B5<=12,4,\"x\"))))","v":2},490]
[2000,5,{"$f":"IF(B6<=3,1,IF(B6<=6,2,IF(B6<=9,3,IF(B6<=12,4,\"x\"))))","v":2},500]
[2000,6,{"$f":"IF(B7<=3,1,IF(B7<=6,2,IF(B7<=9,3,IF(B7<=12,4,\"x\"))))","v":2},3000]
[2000,7,{"$f":"IF(B8<=3,1,IF(B8<=6,2,IF(B8<=9,3,IF(B8<=12,4,\"x\"))))","v":3},54]
[2000,8,{"$f":"IF(B9<=3,1,IF(B9<=6,2,IF(B9<=9,3,IF(B9<=12,4,\"x\"))))","v":3},32]
[2000,9,{"$f":"IF(B10<=3,1,IF(B10<=6,2,IF(B10<=9,3,IF(B10<=12,4,\"x\"))))","v":3},36]
[2000,10,{"$f":"IF(B11<=3,1,IF(B11<=6,2,IF(B11<=9,3,IF(B11<=12,4,\"x\"))))","v":4},75]
[2000,11,{"$f":"IF(B12<=3,1,IF(B12<=6,2,IF(B12<=9,3,IF(B12<=12,4,\"x\"))))","v":4},2]
[2000,12,{"$f":"IF(B13<=3,1,IF(B13<=6,2,IF(B13<=9,3,IF(B13<=12,4,\"x\"))))","v":4},21]
[2001,1,{"$f":"IF(B14<=3,1,IF(B14<=6,2,IF(B14<=9,3,IF(B14<=12,4,\"x\"))))","v":1},71]
[2001,2,{"$f":"IF(B15<=3,1,IF(B15<=6,2,IF(B15<=9,3,IF(B15<=12,4,\"x\"))))","v":1},41]
[2001,3,{"$f":"IF(B16<=3,1,IF(B16<=6,2,IF(B16<=9,3,IF(B16<=12,4,\"x\"))))","v":1},64]
[2001,4,{"$f":"IF(B17<=3,1,IF(B17<=6,2,IF(B17<=9,3,IF(B17<=12,4,\"x\"))))","v":2},64]
[2001,5,{"$f":"IF(B18<=3,1,IF(B18<=6,2,IF(B18<=9,3,IF(B18<=12,4,\"x\"))))","v":2},43]
[2001,6,{"$f":"IF(B19<=3,1,IF(B19<=6,2,IF(B19<=9,3,IF(B19<=12,4,\"x\"))))","v":2},71]
[2001,7,{"$f":"IF(B20<=3,1,IF(B20<=6,2,IF(B20<=9,3,IF(B20<=12,4,\"x\"))))","v":3},13]
[2001,8,{"$f":"IF(B21<=3,1,IF(B21<=6,2,IF(B21<=9,3,IF(B21<=12,4,\"x\"))))","v":3},30]
[2001,9,{"$f":"IF(B22<=3,1,IF(B22<=6,2,IF(B22<=9,3,IF(B22<=12,4,\"x\"))))","v":3},69]
[2001,10,{"$f":"IF(B23<=3,1,IF(B23<=6,2,IF(B23<=9,3,IF(B23<=12,4,\"x\"))))","v":4},86]
[2001,11,{"$f":"IF(B24<=3,1,IF(B24<=6,2,IF(B24<=9,3,IF(B24<=12,4,\"x\"))))","v":4},49]
[2001,12,{"$f":"IF(B25<=3,1,IF(B25<=6,2,IF(B25<=9,3,IF(B25<=12,4,\"x\"))))","v":4},100]

{"sheet":"PresentValue","index":11,"n_rows":397,"n_cols":9,"rows_kept":397,"cut":false,"hidden":false,"merged":[]}
[null,null,null,"Table 1",null,1000]
["Table 1  A VALUATION OF THE PRESENT VALUE OF MONTHLY PAYMENTS OF "]
[null,null,null,null,"Interest rates on","Present"]
[null,"2013-04-01","Period","Payment","2013-03-25","Value"]
[1,"2013-04-01",1,{"$f":"F1","v":1000},{"$f":"VLOOKUP(B5,$D$126:$I$394,6,TRUE)/100","v":-3.3900000000000002E-3},{"$f":"D5/(1+E5)^((B5-$B$4)/365.25)","v":1000}]
[{"$f":"A5+1","v":2},"2013-06-01",{"$f":"C5+1","v":2},{"$f":"D5","v":1000},{"$f":"VLOOKUP(B6,$D$126:$I$394,6,TRUE)/100","v":5.1999999999999995E-4}]
[{"$f":"A6+1","v":3},"2013-07-01",{"$f":"C6+1","v":3},{"$f":"D6","v":1000},7.3999999999999999E-4]
[4,"2013-08-01",4,1000,5.6000000000000006E-4]
[5,"2013-09-01",5,1000,1.0299999999999999E-3]
[6,"2013-10-01",6,1000,1.1200000000000001E-3]
[7,"2013-11-01",7,1000,1.2900000000000001E-3]
[8,"2013-12-01",8,1000,1.2900000000000001E-3]
[9,"2014-01-01",9,1000,1.4099999999999998E-3]
[10,"2014-02-01",10,1000,1.5100000000000001E-3]
[11,"2014-03-01",11,1000,1.58E-3]
[12,"2014-04-01",12,1000,1.6000000000000001E-3]
[13,"2014-05-01",13,1000,1.7000000000000001E-3]
[14,"2014-06-01",14,1000,1.7399999999999998E-3]
[15,"2014-07-01",15,1000,1.8799999999999999E-3]
[16,"2014-08-01",16,1000,1.97E-3]
[17,"2014-09-01",17,1000,2.1199999999999999E-3]
[18,"2014-10-01",18,1000,1.9300000000000001E-3]
[19,"2014-11-01",19,1000,2.2200000000000002E-3]
[20,"2014-12-01",20,1000,2.2899999999999999E-3]
[21,"2015-01-01",21,1000,2.3699999999999997E-3]
[22,"2015-02-01",22,1000,2.31E-3]
[23,"2015-03-01",23,1000,2.5100000000000001E-3]
[24,"2015-04-01",24,1000,2.5100000000000001E-3]
[25,"2015-05-01",25,1000,2.64E-3]
[26,"2015-06-01",26,1000,2.7700000000000003E-3]
[27,"2015-07-01",27,1000,2.8599999999999997E-3]
[28,"2015-08-01",28,1000,2.98E-3]
[29,"2015-09-01",29,1000,3.0399999999999997E-3]
[30,"2015-10-01",30,1000,3.0699999999999998E-3]
[31,"2015-11-01",31,1000,3.2500000000000003E-3]
[32,"2015-12-01",32,1000,3.4399999999999999E-3]
[33,"2016-01-01",33,1000,3.5199999999999997E-3]
[34,"2016-02-01",34,1000,3.62E-3]
[35,"2016-03-01",35,1000,3.7299999999999998E-3]
[36,"2016-04-01",36,1000,3.8900000000000002E-3]
[37,"2016-05-01",37,1000,4.1099999999999999E-3]
[38,"2016-06-01",38,1000,4.1599999999999996E-3]
[39,"2016-07-01",39,1000,4.2100000000000002E-3]
[40,"2016-08-01",40,1000,4.3299999999999996E-3]
[41,"2016-09-01",41,1000,4.5999999999999999E-3]
[42,"2016-10-01",42,1000,4.6600000000000001E-3]
[43,"2016-11-01",43,1000,4.9399999999999999E-3]
[44,"2016-12-01",44,1000,5.2100000000000002E-3]
[45,"2017-01-01",45,1000,5.1600000000000005E-3]
[46,"2017-02-01",46,1000,5.4200000000000003E-3]
[47,"2017-03-01",47,1000,5.5800000000000008E-3]
[48,"2017-04-01",48,1000,5.7399999999999994E-3]
[49,"2017-05-01",49,1000,6.0000000000000001E-3]
[50,"2017-06-01",50,1000,6.0699999999999999E-3]
[51,"2017-07-01",51,{"$f":"+D53","v":1000},6.28E-3]
[52,"2017-08-01",52,1000,6.4800000000000005E-3]
[53,"2017-09-01",53,1000,6.6500000000000005E-3]
[54,"2017-10-01",54,1000,6.8799999999999998E-3]
[55,"2017-11-01",55,1000,7.0399999999999994E-3]
[56,"2017-12-01",56,1000,7.2099999999999994E-3]
[57,"2018-01-01",57,1000,7.26E-3]
[58,"2018-02-01",58,1000,7.4700000000000001E-3]
[59,"2018-03-01",59,1000,7.6500000000000005E-3]
[60,"2018-04-01",60,1000,7.8300000000000002E-3]
[61,"2018-05-01",61,1000,8.0499999999999999E-3]
[62,"2018-06-01",62,1000,8.2699999999999996E-3]
[63,"2018-07-01",63,1000,8.5000000000000006E-3]
[64,"2018-08-01",64,1000,8.5599999999999999E-3]
[65,"2018-09-01",65,1000,8.8299999999999993E-3]
[66,"2018-10-01",66,1000,{"$f":"VLOOKUP(B70,$D$126:$I$394,6,TRUE)/100","v":9.0500000000000008E-3}]
[{"$f":"A70+1","v":67},"2018-11-01",{"$f":"C70+1","v":67},{"$f":"D70","v":1000},9.1500000000000001E-3]
[68,"2018-12-01",68,1000,9.4500000000000001E-3]
[69,"2019-01-01",69,1000,9.6600000000000002E-3]
[70,"2019-02-01",70,1000,9.8999999999999991E-3]
[71,"2019-03-01",71,1000,1.014E-2]
[72,"2019-04-01",72,1000,1.03E-2]
[73,"2019-05-01",73,1000,1.048E-2]
[74,"2019-06-01",74,1000,1.0700000000000001E-2]
[75,"2019-07-01",75,1000,1.089E-2]
[76,"2019-08-01",76,1000,1.1180000000000001E-2]
[77,"2019-09-01",77,1000,1.142E-2]
[78,"2019-10-01",78,1000,1.15E-2]
[79,"2019-11-01",79,1000,1.1699999999999999E-2]
[80,"2019-12-01",80,1000,1.1990000000000001E-2]
[81,"2020-01-01",81,1000,1.218E-2]
[82,"2020-02-01",82,1000,1.2370000000000001E-2]
[83,"2020-03-01",83,1000,1.264E-2]
[84,"2020-04-01",84,1000,1.264E-2]
[85,"2020-05-01",85,1000,1.264E-2]
[86,"2020-06-01",86,1000,1.2030000000000001E-2]
[87,"2020-07-01",87,1000,1.2030000000000001E-2]
[88,"2020-08-01",88,1000,1.2030000000000001E-2]
[89,"2020-09-01",89,1000,1.2659999999999999E-2]
[90,"2020-10-01",90,1000,1.2659999999999999E-2]
[91,"2020-11-01",91,1000,1.2659999999999999E-2]
[92,"2020-12-01",92,1000,1.414E-2]
[93,"2021-01-01",93,1000,1.414E-2]
[94,"2021-02-01",94,1000,1.414E-2]
[95,"2021-03-01",95,1000,1.3879999999999998E-2]
[96,"2021-04-01",96,1000,1.3879999999999998E-2]
[97,"2021-05-01",97,1000,1.3879999999999998E-2]
[98,"2021-06-01",98,1000,1.431E-2]
[99,"2021-07-01",{"$f":"C102+1","v":99},{"$f":"D102","v":1000},1.431E-2]
[100,"2021-08-01",100,1000,1.431E-2]
[101,"2021-09-01",101,1000,1.485E-2]
[102,"2021-10-01",102,1000,1.485E-2]
[103,"2021-11-01",103,1000,1.485E-2]
[104,"2021-12-01",104,1000,1.55E-2]
[105,"2022-01-01",105,1000,1.55E-2]
[106,"2022-02-01",106,1000,1.55E-2]
[107,"2022-03-01",107,1000,1.7059999999999999E-2]
[108,"2022-04-01",108,1000,1.7059999999999999E-2]
[109,"2022-05-01",109,1000,1.7059999999999999E-2]
[110,"2022-06-01",110,1000,1.77E-2]
[111,"2022-07-01",111,1000,1.77E-2]
[null,null,"Totals",{"$f":"SUM(D5:D115)","v":111000}]
[]
[null,null,null,"Average interest rate",{"$f":"AVERAGE(E5:E115)","v":7.7066666666666681E-3}]
[]
[]
[]
[]
[]
[]
[]
[null,null,null,"2013-03-31",0.75,100.0078,100.01560000000001,"unch.",-0.38600000000000001]
[null,null,null,"2013-03-31",2.5,100.0313,100.0391,-7.7999999999999996E-3,-0.33900000000000002]
[null,null,null,"2013-04-15",1.75,100.0859,100.0938,-7.7999999999999996E-3,4.2999999999999997E-2]
[null,null,null,"2013-04-30",0.625,100.0547,100.0625,7.7999999999999996E-3,-2.1000000000000001E-2]
[null,null,null,"2013-04-30",3.125,100.2891,100.29689999999999,-7.7999999999999996E-3,5.3999999999999999E-2]
[null,null,null,"2013-05-15",1.375,100.17189999999999,100.1797,-7.7999999999999996E-3,7.3999999999999996E-2]
[null,null,null,"2013-05-15",3.625,100.48439999999999,100.4922,-1.5599999999999999E-2,0.06]
[null,null,null,"2013-05-31",0.5,100.0703,100.07810000000001,"unch.",6.9000000000000006E-2]
[null,null,null,"2013-05-31",3.5,100.60939999999999,100.625,-1.5599999999999999E-2,5.1999999999999998E-2]
[null,null,null,"2013-06-15",1.125,100.2266,100.23439999999999,-7.7999999999999996E-3,7.0999999999999994E-2]
[null,null,null,"2013-06-30",0.375,100.0703,100.07810000000001,"unch.",0.08]
[null,null,null,"2013-06-30",3.375,100.8672,100.875,-7.7999999999999996E-3,7.3999999999999996E-2]
[null,null,null,"2013-07-15",1,100.2734,100.2813,-7.7999999999999996E-3,8.2000000000000003E-2]
[null,null,null,"2013-07-31",0.375,100.0938,100.1016,"unch.",8.5000000000000006E-2]
[null,null,null,"2013-07-31",3.375,101.1328,101.1641,-2.3400000000000001E-2,5.6000000000000001E-2]
[null,null,null,"2013-08-15",0.75,100.25,100.2578,"unch.",9.1999999999999998E-2]
[null,null,null,"2013-08-15",4.25,101.6172,101.6328,-7.7999999999999996E-3,8.5999999999999993E-2]
[null,null,null,"2013-08-31",0.125,100,100.0078,"unch.",0.107]
[null,null,null,"2013-08-31",3.125,101.2891,101.29689999999999,-7.7999999999999996E-3,0.10299999999999999]
[null,null,null,"2013-09-15",0.75,100.2891,100.3047,-7.7999999999999996E-3,0.10199999999999999]
[null,null,null,"2013-09-30",0.125,100,100.0078,"unch.",0.11]
[null,null,null,"2013-09-30",3.125,101.5391,101.54689999999999,-7.7999999999999996E-3,0.112]
[null,null,null,"2013-10-15",0.5,100.20310000000001,100.2188,"unch.",0.106]
[null,null,null,"2013-10-31",0.25,100.0703,100.07810000000001,"unch.",0.11899999999999999]
[null,null,null,"2013-10-31",2.75,101.54689999999999,101.5625,-1.5599999999999999E-2,0.129]
[null,null,null,"2013-11-15",0.5,100.2266,100.2422,"unch.",0.12]
[null,null,null,"2013-11-15",4.25,102.6172,102.625,-7.7999999999999996E-3,0.13300000000000001]
[null,null,null,"2013-11-30",0.25,100.0703,100.07810000000001,"unch.",0.13500000000000001]
[null,null,null,"2013-11-30",2,101.2578,101.2734,-7.7999999999999996E-3,0.129]
[null,null,null,"2013-12-15",0.75,100.4297,100.4375,-7.7999999999999996E-3,0.14399999999999999]
[null,null,null,"2013-12-31",0.125,99.984399999999994,99.992199999999997,"unch.",0.13500000000000001]
[null,null,null,"2013-12-31",1.5,101.0234,101.0391,-7.7999999999999996E-3,0.14099999999999999]
[null,null,null,"2014-01-15",1,100.6797,100.6875,-7.7999999999999996E-3,0.14699999999999999]
[null,null,null,"2014-01-31",0.25,100.0859,100.0938,"unch.",0.14000000000000001]
[null,null,null,"2014-01-31",1.75,101.3516,101.35939999999999,-7.7999999999999996E-3,0.151]
[null,null,null,"2014-02-15",1.25,100.9688,100.9766,-7.7999999999999996E-3,0.154]
[null,null,null,"2014-02-15",4,103.4063,103.4297,-2.3400000000000001E-2,0.152]
[null,null,null,"2014-02-28",0.25,100.0859,100.0938,"unch.",0.14899999999999999]
[null,null,null,"2014-02-28",1.875,101.5859,101.5938,-7.7999999999999996E-3,0.158]
[null,null,null,"2014-03-15",1.25,101.0547,101.0625,"unch.",0.154]
[null,null,null,"2014-03-31",0.25,100.0859,100.0938,"unch.",0.157]
[null,null,null,"2014-03-31",1.75,101.6016,101.60939999999999,-7.7999999999999996E-3,0.16]
[null,null,null,"2014-04-15",1.25,101.125,101.1328,-7.7999999999999996E-3,0.17499999999999999]
[null,null,null,"2014-04-30",0.25,100.0625,100.1016,"unch.",0.157]
[null,null,null,"2014-04-30",1.875,101.85939999999999,101.8672,"unch.",0.17]
[null,null,null,"2014-05-15",1,100.9297,100.9453,7.7999999999999996E-3,0.16800000000000001]
[null,null,null,"2014-05-15",4.75,105.1875,105.1953,-7.7999999999999996E-3,0.17799999999999999]
[null,null,null,"2014-05-31",0.25,100.0625,100.1016,"unch.",0.16400000000000001]
[null,null,null,"2014-05-31",2.25,102.4258,102.4492,-3.8999999999999998E-3,0.17399999999999999]
[null,null,null,"2014-06-15",0.75,100.6875,100.6953,"unch.",0.18]
[null,null,null,"2014-06-30",0.25,100.07810000000001,100.0859,7.7999999999999996E-3,0.182]
[null,null,null,"2014-06-30",2.625,103.0625,103.07810000000001,-1.5599999999999999E-2,0.188]
[null,null,null,"2014-07-15",0.625,100.54689999999999,100.5547,"unch.",0.2]
[null,null,null,"2014-07-31",0.125,99.890600000000006,99.898399999999995,7.7999999999999996E-3,0.2]
[null,null,null,"2014-07-31",2.625,103.2578,103.2734,"unch.",0.19700000000000001]
[null,null,null,"2014-08-15",0.5,100.3984,100.42189999999999,"unch.",0.19600000000000001]
[null,null,null,"2014-08-15",4.25,105.5938,105.6328,-3.9100000000000003E-2,0.19700000000000001]
[null,null,null,"2014-08-31",0.25,100.04689999999999,100.0547,"unch.",0.21199999999999999]
[null,null,null,"2014-08-31",2.375,103.0703,103.0859,1.5599999999999999E-2,0.21199999999999999]
[null,null,null,"2014-09-15",0.25,100.04689999999999,100.0703,7.7999999999999996E-3,0.20200000000000001]
[null,null,null,"2014-09-30",0.25,100.04689999999999,100.0547,1.5599999999999999E-2,0.214]
[null,null,null,"2014-09-30",2.375,103.2734,103.29689999999999,3.1300000000000001E-2,0.193]
[null,null,null,"2014-10-15",0.5,100.4297,100.4375,7.7999999999999996E-3,0.218]
[null,null,null,"2014-10-31",0.25,100.01949999999999,100.04300000000001,-3.8999999999999998E-3,0.223]
[null,null,null,"2014-10-31",2.375,103.4063,103.4297,-7.7999999999999996E-3,0.222]
[null,null,null,"2014-11-15",0.375,100.2148,100.2383,-3.8999999999999998E-3,0.22900000000000001]
[null,null,null,"2014-11-15",4.25,106.5938,106.6172,3.9100000000000003E-2,0.20200000000000001]
[null,null,null,"2014-11-30",0.25,100.01949999999999,100.04300000000001,3.8999999999999998E-3,0.224]
[null,null,null,"2014-11-30",2.125,103.1563,103.1797,"unch.",0.22900000000000001]
[null,null,null,"2014-12-15",0.25,100.0234,100.0313,7.7999999999999996E-3,0.23200000000000001]
[null,null,null,"2014-12-31",0.125,99.796899999999994,99.835899999999995,7.7999999999999996E-3,0.218]
[null,null,null,"2014-12-31",2.625,104.1953,104.20310000000001,7.7999999999999996E-3,0.23699999999999999]
[null,null,null,"2015-01-15",0.25,100.0625,100.0859,7.7999999999999996E-3,0.20200000000000001]
[null,null,null,"2015-01-31",0.25,100,100.0391,7.7999999999999996E-3,0.22900000000000001]
[null,null,null,"2015-01-31",2.25,103.70310000000001,103.7266,"unch.",0.23100000000000001]
[null,null,null,"2015-02-15",0.25,99.984399999999994,99.992199999999997,7.7999999999999996E-3,0.254]
[null,null,null,"2015-02-15",4,107.0508,107.0742,-1.17E-2,0.25]
[null,null,null,"2015-02-15",11.25,120.7227,120.7461,-2.7300000000000001E-2,0.253]
[null,null,null,"2015-02-28",0.25,99.976600000000005,100.01560000000001,-7.7999999999999996E-3,0.24199999999999999]
[null,null,null,"2015-02-28",2.375,104.0625,104.0859,"unch.",0.251]
[null,null,null,"2015-03-15",0.375,100.2188,100.2266,3.8999999999999998E-3,0.26]
[null,null,null,"2015-03-31",2.5,104.5078,104.51560000000001,"unch.",0.251]
[null,null,null,"2015-04-15",0.375,100.2109,100.23439999999999,-7.7999999999999996E-3,0.26100000000000001]
[null,null,null,"2015-04-30",2.5,104.6484,104.67189999999999,-7.7999999999999996E-3,0.26400000000000001]
[null,null,null,"2015-05-15",0.25,99.921899999999994,99.960899999999995,"unch.",0.26800000000000002]
[null,null,null,"2015-05-15",4.125,108.1875,108.2109,-1.5599999999999999E-2,0.27100000000000002]
[null,null,null,"2015-05-31",2.125,103.98439999999999,104.01560000000001,-2.3400000000000001E-2,0.27700000000000002]
[null,null,null,"2015-06-15",0.375,100.1953,100.20310000000001,"unch.",0.28299999999999997]
[null,null,null,"2015-06-30",1.875,103.57810000000001,103.5859,7.7999999999999996E-3,0.28599999999999998]
[null,null,null,"2015-07-15",0.25,99.882800000000003,99.906300000000002,-7.7999999999999996E-3,0.29099999999999998]
[null,null,null,"2015-07-31",1.75,103.375,103.3984,-1.5599999999999999E-2,0.29799999999999999]
[null,null,null,"2015-08-15",0.25,99.867199999999997,99.875,7.7999999999999996E-3,0.30199999999999999]
[null,null,null,"2015-08-15",4.25,109.3828,109.4063,"unch.",0.30099999999999999]
[null,null,null,"2015-08-15",10.625,124.5391,124.5625,-4.6899999999999997E-2,0.311]
[null,null,null,"2015-08-31",1.25,102.26560000000001,102.2891,"unch.",0.30399999999999999]
[null,null,null,"2015-09-15",0.25,99.820300000000003,99.835899999999995,7.7999999999999996E-3,0.317]
[null,null,null,"2015-09-30",1.25,102.3359,102.35939999999999,7.7999999999999996E-3,0.307]
[null,null,null,"2015-10-15",0.25,99.789100000000005,99.804699999999997,-7.7999999999999996E-3,0.32700000000000001]
[null,null,null,"2015-10-31",1.25,102.3672,102.39060000000001,7.7999999999999996E-3,0.32500000000000001]
[null,null,null,"2015-11-15",0.375,100.1016,100.10939999999999,"unch.",0.33300000000000002]
[null,null,null,"2015-11-15",4.5,110.9063,110.9297,-3.9100000000000003E-2,0.33500000000000002]
[null,null,null,"2015-11-15",9.875,124.95310000000001,124.9766,-5.4699999999999999E-2,0.35399999999999998]
[null,null,null,"2015-11-30",1.375,102.7422,102.75,7.7999999999999996E-3,0.34399999999999997]
[null,null,null,"2015-12-15",0.25,99.718800000000002,99.757800000000003,"unch.",0.33900000000000002]
[null,null,null,"2015-12-31",2.125,104.85939999999999,104.875,-7.7999999999999996E-3,0.35199999999999998]
[null,null,null,"2016-01-15",0.375,100.0391,100.07810000000001,7.7999999999999996E-3,0.34699999999999998]
[null,null,null,"2016-01-31",2,104.60939999999999,104.64060000000001,-7.7999999999999996E-3,0.36199999999999999]
[null,null,null,"2016-02-15",0.375,100.0078,100.04689999999999,"unch.",0.35899999999999999]
[null,null,null,"2016-02-15",4.5,111.85939999999999,111.8828,-3.1300000000000001E-2,0.36599999999999999]
[null,null,null,"2016-02-15",9.25,125.4766,125.5,-6.25E-2,0.377]
[null,null,null,"2016-02-29",2.125,105.0938,105.1016,2.3400000000000001E-2,0.372]
[null,null,null,"2016-02-29",2.625,106.5313,106.5547,-7.7999999999999996E-3,0.373]
[null,null,null,"2016-03-15",0.375,99.976600000000005,100.01560000000001,7.7999999999999996E-3,0.37]
[null,null,null,"2016-03-31",2.25,105.5859,105.5938,1.5599999999999999E-2,0.38100000000000001]
[null,null,null,"2016-03-31",2.375,105.9141,105.9453,"unch.",0.38900000000000001]
[null,null,null,"2016-04-30",2,104.8984,104.9063,"unch.",0.40400000000000003]
[null,null,null,"2016-04-30",2.625,106.7734,106.8047,-1.5599999999999999E-2,0.41099999999999998]
[null,null,null,"2016-05-15",5.125,114.64060000000001,114.67189999999999,"unch.",0.41399999999999998]
[null,null,null,"2016-05-15",7.25,121.2578,121.2891,2.3400000000000001E-2,0.41399999999999998]
[null,null,null,"2016-05-31",1.75,104.20310000000001,104.2188,7.7999999999999996E-3,0.41399999999999998]
[null,null,null,"2016-05-31",3.25,108.9141,108.9453,-3.9100000000000003E-2,0.41599999999999998]
[null,null,null,"2016-06-30",1.5,103.4375,103.45310000000001,7.7999999999999996E-3,0.434]
[null,null,null,"2016-06-30",3.25,109.1328,109.1641,-2.3400000000000001E-2,0.42099999999999999]
[null,null,null,"2016-07-31",1.5,103.4766,103.5078,7.7999999999999996E-3,0.44400000000000001]
[null,null,null,"2016-07-31",3.25,109.32810000000001,109.35939999999999,"unch.",0.433]
[null,null,null,"2016-08-15",4.875,114.8438,114.9063,7.7999999999999996E-3,0.443]
[null,null,null,"2016-08-31",1,101.7891,101.8516,7.7999999999999996E-3,0.45500000000000002]
[null,null,null,"2016-08-31",3,108.6016,108.6328,7.7999999999999996E-3,0.46]
[null,null,null,"2016-09-30",1,101.7813,101.8359,1.5599999999999999E-2,0.47299999999999998]
[null,null,null,"2016-09-30",3,108.7891,108.8203,9.3799999999999994E-2,0.46600000000000003]
[null,null,null,"2016-10-31",1,101.7813,101.8125,2.3400000000000001E-2,0.49099999999999999]
[null,null,null,"2016-10-31",3.125,109.3438,109.3672,"unch.",0.49399999999999999]
[null,null,null,"2016-11-15",4.625,114.76560000000001,114.79689999999999,-1.5599999999999999E-2,0.51400000000000001]
[null,null,null,"2016-11-15",7.5,125.0625,125.0938,-4.6899999999999997E-2,0.52700000000000002]
[null,null,null,"2016-11-30",0.875,101.2891,101.3203,1.5599999999999999E-2,0.51200000000000001]
[null,null,null,"2016-11-30",2.75,108.0859,108.1172,-7.7999999999999996E-3,0.52100000000000002]
[null,null,null,"2016-12-31",0.875,101.26560000000001,101.2813,1.5599999999999999E-2,0.53100000000000003]
[null,null,null,"2016-12-31",3.25,110.1484,110.1797,9.3799999999999994E-2,0.51600000000000001]
[null,null,null,"2017-01-31",0.875,101.2109,101.2188,1.5599999999999999E-2,0.55500000000000005]
[null,null,null,"2017-01-31",3.125,109.79689999999999,109.82810000000001,1.5599999999999999E-2,0.54200000000000004]
[null,null,null,"2017-02-15",4.625,115.5625,115.5938,"unch.",0.56799999999999995]
[null,null,null,"2017-02-28",0.875,101.1641,101.1875,"unch.",0.56899999999999995]
[null,null,null,"2017-02-28",3,109.42189999999999,109.4766,-4.6899999999999997E-2,0.55800000000000005]
[null,null,null,"2017-03-31",1,101.6328,101.64060000000001,1.5599999999999999E-2,0.58599999999999997]
[null,null,null,"2017-03-31",3.25,110.5703,110.6016,-1.5599999999999999E-2,0.57399999999999995]
[null,null,null,"2017-04-30",0.875,101.0547,101.1016,1.5599999999999999E-2,0.60199999999999998]
[null,null,null,"2017-04-30",3.125,110.17189999999999,110.20310000000001,-5.4699999999999999E-2,0.6]
[null,null,null,"2017-05-15",4.5,115.85939999999999,115.89060000000001,-1.5599999999999999E-2,0.60599999999999998]
[null,null,null,"2017-05-15",8.75,133.3125,133.34379999999999,-1.5599999999999999E-2,0.58299999999999996]
[null,null,null,"2017-05-31",0.625,99.968800000000002,100.01560000000001,2.3400000000000001E-2,0.621]
[null,null,null,"2017-05-31",2.75,108.7734,108.8359,-1.5599999999999999E-2,0.60699999999999998]
[null,null,null,"2017-06-30",0.75,100.4297,100.4453,1.5599999999999999E-2,0.64400000000000002]
[null,null,null,"2017-06-30",2.5,107.8359,107.8672,3.1300000000000001E-2,0.628]
[null,null,null,"2017-07-31",0.5,99.296899999999994,99.304699999999997,2.3400000000000001E-2,0.66200000000000003]
[null,null,null,"2017-07-31",2.375,107.3672,107.3984,2.3400000000000001E-2,0.64800000000000002]
[null,null,null,"2017-08-15",4.75,117.7188,117.75,3.9100000000000003E-2,0.64500000000000002]
[null,null,null,"2017-08-15",8.875,135.5703,135.60159999999999,-6.25E-2,0.64100000000000001]
[null,null,null,"2017-08-31",0.625,99.75,99.773399999999995,-7.7999999999999996E-3,0.67700000000000005]
[null,null,null,"2017-08-31",1.875,105.2109,105.2734,-1.5599999999999999E-2,0.66500000000000004]
[null,null,null,"2017-09-30",0.625,99.648399999999995,99.656300000000002,7.7999999999999996E-3,0.70299999999999996]
[null,null,null,"2017-09-30",1.875,105.2266,105.26560000000001,"unch.",0.68799999999999994]
[null,null,null,"2017-10-31",0.75,100.14060000000001,100.1484,1.5599999999999999E-2,0.71699999999999997]
[null,null,null,"2017-10-31",1.875,105.2422,105.2891,3.1300000000000001E-2,0.70399999999999996]
[null,null,null,"2017-11-15",4.25,116.125,116.1563,-2.3400000000000001E-2,0.70299999999999996]
[null,null,null,"2017-11-30",0.625,99.507800000000003,99.523399999999995,1.5599999999999999E-2,0.72899999999999998]
[null,null,null,"2017-11-30",2.25,107.01560000000001,107.0234,7.0300000000000001E-2,0.72099999999999997]
[null,null,null,"2017-12-31",0.75,99.976600000000005,100.0234,2.3400000000000001E-2,0.745]
[null,null,null,"2017-12-31",2.75,109.42189999999999,109.4609,4.6899999999999997E-2,0.72599999999999998]
[null,null,null,"2018-01-31",0.875,100.4688,100.51560000000001,2.3400000000000001E-2,0.76600000000000001]
[null,null,null,"2018-01-31",2.625,108.8984,108.9297,-2.3400000000000001E-2,0.747]
[null,null,null,"2018-02-15",3.5,113.0859,113.0938,"unch.",0.76800000000000002]
[null,null,null,"2018-02-28",0.75,99.804699999999997,99.851600000000005,2.3400000000000001E-2,0.78100000000000003]
[null,null,null,"2018-02-28",2.75,109.57810000000001,109.5859,3.9100000000000003E-2,0.76500000000000001]
[null,null,null,"2018-03-31",2.875,110.2188,110.26560000000001,3.1300000000000001E-2,0.78300000000000003]
[null,null,null,"2018-04-30",2.625,109.0234,109.0703,2.3400000000000001E-2,0.80500000000000005]
[null,null,null,"2018-05-15",3.875,115.4063,115.45310000000001,3.1300000000000001E-2,0.79900000000000004]
[null,null,null,"2018-05-15",9.125,141.875,141.92189999999999,-3.1300000000000001E-2,0.78400000000000003]
[null,null,null,"2018-05-31",2.375,107.7422,107.8359,7.7999999999999996E-3,0.82699999999999996]
[null,null,null,"2018-06-30",2.375,107.7891,107.8359,7.7999999999999996E-3,0.85]
[null,null,null,"2018-07-31",2.25,107.2266,107.2734,2.3400000000000001E-2,0.85599999999999998]
[null,null,null,"2018-08-15",4,116.57810000000001,116.625,-3.1300000000000001E-2,0.84]
[null,null,null,"2018-08-31",1.5,103.17189999999999,103.26560000000001,"unch.",0.88300000000000001]
[null,null,null,"2018-09-30",1.375,102.4922,102.5234,3.9100000000000003E-2,0.90500000000000003]
[null,null,null,"2018-10-31",1.75,104.5,104.54689999999999,5.4699999999999999E-2,0.91500000000000004]
[null,null,null,"2018-11-15",3.75,115.5625,115.6484,4.6899999999999997E-2,0.89700000000000002]
[null,null,null,"2018-11-15",9,144.5078,144.5547,-2.3400000000000001E-2,0.88200000000000001]
[null,null,null,"2018-11-30",1.375,102.32810000000001,102.375,6.25E-2,0.94499999999999995]
[null,null,null,"2018-12-31",1.375,102.2422,102.2891,5.4699999999999999E-2,0.96599999999999997]
[null,null,null,"2019-01-31",1.25,101.4297,101.4766,1.5599999999999999E-2,0.99]
[null,null,null,"2019-02-15",2.75,110.0234,110.0703,-3.1300000000000001E-2,0.98599999999999999]
[null,null,null,"2019-02-15",8.875,145.35939999999999,145.40629999999999,-1.5599999999999999E-2,0.93600000000000005]
[null,null,null,"2019-02-28",1.375,102.0234,102.0703,-1.5599999999999999E-2,1.014]
[null,null,null,"2019-03-31",1.5,102.6875,102.73439999999999,7.7999999999999996E-3,1.03]
[null,null,null,"2019-04-30",1.25,101.14060000000001,101.1875,4.6899999999999997E-2,1.048]
[null,null,null,"2019-05-15",3.125,112.45310000000001,112.4766,3.9100000000000003E-2,1.0229999999999999]
[null,null,null,"2019-05-31",1.125,100.2813,100.32810000000001,5.4699999999999999E-2,1.07]
[null,null,null,"2019-06-30",1,99.414100000000005,99.460899999999995,6.25E-2,1.089]
[null,null,null,"2019-07-31",0.875,98.468800000000002,98.515600000000006,3.1300000000000001E-2,1.1180000000000001]
[null,null,null,"2019-08-15",3.625,115.6172,115.6641,3.1300000000000001E-2,1.0820000000000001]
[null,null,null,"2019-08-15",8.125,143.64060000000001,143.6875,-2.3400000000000001E-2,1.042]
[null,null,null,"2019-08-31",1,99.093800000000002,99.125,6.25E-2,1.1419999999999999]
[null,null,null,"2019-09-30",1,98.984399999999994,99.0625,2.3400000000000001E-2,1.1499999999999999]
[null,null,null,"2019-10-31",1.25,100.4922,100.5078,3.9100000000000003E-2,1.17]
[null,null,null,"2019-11-15",3.375,114.2422,114.25,4.6899999999999997E-2,1.1399999999999999]
[null,null,null,"2019-11-30",1,98.718800000000002,98.726600000000005,4.6899999999999997E-2,1.1990000000000001]
[null,null,null,"2019-12-31",1.125,99.351600000000005,99.398399999999995,4.6899999999999997E-2,1.218]
[null,null,null,"2020-01-31",1.375,100.85939999999999,100.9063,4.6899999999999997E-2,1.2370000000000001]
[null,null,null,"2020-02-15",3.625,115.9141,115.9297,4.6899999999999997E-2,1.2090000000000001]
[null,null,null,"2020-02-15",8.5,148.5,148.54689999999999,3.1300000000000001E-2,1.1519999999999999]
[null,null,null,"2020-02-29",1.25,99.859399999999994,99.906300000000002,3.9100000000000003E-2,1.264]
[null,null,null,"2020-05-15",3.5,115.1641,115.2109,5.4699999999999999E-2,1.2649999999999999]
[null,null,null,"2020-05-15",8.75,151.4297,151.47659999999999,"unch.",1.2030000000000001]
[null,null,null,"2020-08-15",2.625,108.8984,108.9453,6.25E-2,1.349]
[null,null,null,"2020-08-15",8.75,152.60939999999999,152.65629999999999,3.1300000000000001E-2,1.266]
[null,null,null,"2020-11-15",2.625,108.7188,108.73439999999999,5.4699999999999999E-2,1.4139999999999999]
[null,null,null,"2021-02-15",3.625,116.125,116.17189999999999,0.1016,1.4490000000000001]
[null,null,null,"2021-02-15",7.875,148.28129999999999,148.32810000000001,2.3400000000000001E-2,1.3879999999999999]
[null,null,null,"2021-05-15",3.125,112.2266,112.2578,4.6899999999999997E-2,1.518]
[null,null,null,"2021-05-15",8.125,151.20310000000001,151.25,"unch.",1.431]
[null,null,null,"2021-08-15",2.125,104.0547,104.125,-7.7999999999999996E-3,1.5980000000000001]
[null,null,null,"2021-08-15",8.125,152.16409999999999,152.21090000000001,1.5599999999999999E-2,1.4850000000000001]
[null,null,null,"2021-11-15",2,102.6953,102.7734,2.3400000000000001E-2,1.6539999999999999]
[null,null,null,"2021-11-15",8,151.91409999999999,151.96090000000001,3.1300000000000001E-2,1.55]
[null,null,null,"2022-02-15",2,102.35939999999999,102.4141,2.3400000000000001E-2,1.706]
[null,null,null,"2022-05-15",1.75,99.781300000000002,99.828100000000006,-7.7999999999999996E-3,1.77]
[null,null,null,"2022-08-15",1.625,98.25,98.257800000000003,7.7999999999999996E-3,1.8280000000000001]
[null,null,null,"2022-08-15",7.25,148.01560000000001,148.0625,-3.1300000000000001E-2,1.6930000000000001]
[null,null,null,"2022-11-15",1.625,97.726600000000005,97.789100000000005,7.7999999999999996E-3,1.877]
[null,null,null,"2022-11-15",7.625,152.1953,152.2422,6.25E-2,1.7190000000000001]
[null,null,null,"2023-02-15",2,100.73439999999999,100.79689999999999,-1.5599999999999999E-2,1.911]
[null,null,null,"2023-02-15",7.125,148.23439999999999,148.2578,7.7999999999999996E-3,1.782]
[null,null,null,"2023-08-15",6.25,140.97659999999999,140.9922,-7.7999999999999996E-3,1.887]
[null,null,null,"2024-11-15",7.5,156.1328,156.20310000000001,3.1300000000000001E-2,2.048]
[null,null,null,"2025-02-15",7.625,158.14840000000001,158.1875,-3.1300000000000001E-2,2.077]
[null,null,null,"2025-08-15",6.875,150.95310000000001,151,"unch.",2.161]
[null,null,null,"2026-02-15",6,141.66409999999999,141.7578,-7.7999999999999996E-3,2.25]
[null,null,null,"2026-08-15",6.75,151.1953,151.27340000000001,-2.3400000000000001E-2,2.2839999999999998]
[null,null,null,"2026-11-15",6.5,148.5547,148.6328,-2.3400000000000001E-2,2.3199999999999998]
[null,null,null,"2027-02-15",6.625,150.46090000000001,150.53909999999999,-3.1300000000000001E-2,2.3420000000000001]
[null,null,null,"2027-08-15",6.375,148.0078,148.08590000000001,-0.1641,2.403]
[null,null,null,"2027-11-15",6.125,145.10159999999999,145.1797,-0.1328,2.4369999999999998]
[null,null,null,"2028-08-15",5.5,137.90629999999999,137.98439999999999,-3.1300000000000001E-2,2.5099999999999998]
[null,null,null,"2028-11-15",5.25,134.73439999999999,134.8125,-3.9100000000000003E-2,2.5390000000000001]
[null,null,null,"2029-02-15",5.25,134.91409999999999,134.9922,-3.9100000000000003E-2,2.5569999999999999]
[null,null,null,"2029-08-15",6.125,147.40629999999999,147.48439999999999,-0.1484,2.56]
[null,null,null,"2030-05-15",6.25,150.1797,150.2578,-0.1875,2.5979999999999999]
[null,null,null,"2031-02-15",5.375,138.375,138.45310000000001,-0.125,2.66]
[null,null,null,"2036-02-15",4.5,126.5703,126.6484,-8.5900000000000004E-2,2.899]
[null,null,null,"2037-02-15",4.75,131.125,131.20310000000001,-7.0300000000000001E-2,2.9260000000000002]
[null,null,null,"2037-05-15",5,135.6328,135.71090000000001,-7.0300000000000001E-2,2.9260000000000002]
[null,null,null,"2038-02-15",4.375,124.5859,124.6641,-7.8100000000000003E-2,2.9670000000000001]
[null,null,null,"2038-05-15",4.5,126.9063,126.98439999999999,-0.1172,2.9689999999999999]
[null,null,null,"2039-02-15",3.5,108.3438,108.42189999999999,-8.5900000000000004E-2,3.028]
[null,null,null,"2039-05-15",4.25,122.45310000000001,122.5313,-7.0300000000000001E-2,3]
[null,null,null,"2039-08-15",4.5,127.23439999999999,127.3125,-0.1094,2.9950000000000001]
[null,null,null,"2039-11-15",4.375,124.8516,124.9297,-8.5900000000000004E-2,3.008]
[null,null,null,"2040-02-15",4.625,129.71090000000001,129.78909999999999,-9.3799999999999994E-2,3.0030000000000001]
[null,null,null,"2040-05-15",4.375,124.8672,124.9453,-0.1016,3.0209999999999999]
[null,null,null,"2040-08-15",3.875,115.1875,115.26560000000001,-9.3799999999999994E-2,3.0489999999999999]
[null,null,null,"2040-11-15",4.25,122.4688,122.54689999999999,-0.1094,3.0379999999999998]
[null,null,null,"2041-02-15",4.75,132.28909999999999,132.3672,-0.1094,3.024]
[null,null,null,"2041-05-15",4.375,124.9297,125.0078,-0.1172,3.0449999999999999]
[null,null,null,"2041-08-15",3.75,112.5859,112.6641,-0.1172,3.0779999999999998]
[null,null,null,"2041-11-15",3.125,100.1563,100.1875,-0.1094,3.1150000000000002]
[null,null,null,"2042-02-15",3.125,100.0625,100.1016,-9.3799999999999994E-2,3.12]
[null,null,null,"2042-05-15",3,97.460899999999995,97.492199999999997,-0.125,3.1320000000000001]
[null,null,null,"2042-08-15",2.75,92.351600000000005,92.367199999999997,-0.1094,3.15]
[null,null,null,"2042-11-15",2.75,92.218800000000002,92.281300000000002,-0.1094,3.153]
[null,null,null,"2043-02-15",3.125,99.695300000000003,99.757800000000003,-0.1094,3.137]
[]
[]
[null,null,null,"http://online.wsj.com/mdc/public/page/2_3020-treasury.html?mod=mdc_bnd_pglnk"]